program: Gaussian 09
title: 000264162
version: EM64L-G09RevD.01
frameworkgroup: C1[X(C13H16N4O6)]
method: RPBEPBE
basis: SDD
operation: Freq
keyword: #p
keyword: freq=noraman
keyword: PBEPBE/SDD
title: #p freq=noraman PBEPBE/SDD
converged: NO YES NO NO
title: Mulliken charges:
elementType: O O O O O O N N N N C C C C C C C C C C C C C H H H H H H H H H H H H H H H H
charge: -0.250512 -0.426929 -0.236797 -0.264090 -0.253080 -0.268471 -0.206171 -0.376028 -0.199799 0.030068 -0.351192 0.104206 0.148845 0.156500 0.040596 0.146189 -0.369550 0.203277 0.272085 -0.608041 -0.595031 -0.264331 -0.661819 0.286100 0.373915 0.211784 0.256418 0.272314 0.260219 0.245184 0.256802 0.270051 0.258427 0.370313 0.235768 0.229086 0.222531 0.231720 0.249444
chargesum: 0.00000
title: Mulliken charges with hydrogens summed into heavy atoms:
elementType: O O O O O O N N N N C C C C C C C C C C C C C
charge: -0.250512 -0.056616 -0.236797 -0.264090 -0.253080 -0.268471 -0.206171 -0.002113 -0.199799 0.030068 -0.065092 0.104206 0.148845 0.156500 0.040596 0.146189 0.098651 0.203277 0.272085 0.169677 0.190249 0.200523 0.041875
polarizability: 2.74600106e+02 1.84877987e+01 2.07577693e+02 1.07154976e+01 -1.48315792e+01 1.32722959e+02
1716.lowfreq: -3.6813 -1.6397 -0.0010 -0.0006 -0.0005 2.1595 21.7889 26.5825 46.7919
frequency: 21.6863 26.5592 46.7806 53.5798 73.8423 75.4086 91.8175 97.5503 100.3735 108.2374 118.8310 130.7655 137.5015 187.4146 201.2899 208.6675 228.5134 255.0308 268.5290 292.7926 307.1551 331.7871 341.3199 342.8063 389.5539 392.3557 395.7482 406.6148 420.3553 450.2476 478.9833 508.8705 517.7544 592.8488 611.8308 631.4748 649.7193 659.0942 673.0763 703.5465 706.3748 742.9082 768.3109 778.8605 786.0802 811.5648 822.6322 848.2537 853.2894 924.3365 957.5820 974.3252 998.0650 1006.4915 1026.1194 1052.0676 1097.4339 1108.1605 1110.5418 1128.7215 1130.8111 1131.5468 1158.7245 1163.0405 1197.4943 1216.0555 1231.8825 1243.3275 1246.8617 1277.2444 1301.8326 1335.9018 1339.9280 1357.2077 1365.9807 1373.5484 1386.5497 1393.8526 1425.4496 1437.2232 1457.9752 1464.2459 1464.4888 1470.7267 1472.6305 1475.7533 1478.2475 1484.9495 1502.1375 1514.5168 1565.7711 1602.7774 1613.7777 1627.0822 1633.3957 2968.7695 2995.0238 3017.3166 3017.8098 3030.1130 3033.7526 3090.5462 3096.8198 3102.8836 3111.1247 3111.4654 3123.4358 3144.9463 3146.7168 3459.8745 3461.7802
redmass: 5.0215 4.5148 3.4894 4.9595 5.3099 6.7227 6.1384 1.0566 1.1115 4.2837 3.8316 4.9400 6.1814 3.0171 3.5005 2.4124 2.3440 5.4681 3.5081 3.8168 3.0022 5.3925 5.0611 4.6149 7.3721 7.5703 5.8273 9.1576 5.0963 4.5025 7.3165 6.9320 5.6548 1.8391 2.2408 9.2911 5.6379 7.1016 6.0009 10.7725 4.3892 10.3063 5.5086 2.9768 4.3985 1.5504 1.3419 4.9081 3.1720 3.3830 3.5869 2.8222 3.2006 2.0794 4.9397 2.4597 2.1674 4.3727 2.4482 1.3044 1.3269 1.7095 1.6511 3.7524 1.5737 2.7833 3.0819 1.8118 3.2703 1.1319 3.0230 1.8242 2.7635 1.3026 1.8526 3.1121 1.2296 1.2321 1.2820 1.3737 1.1007 1.0741 1.3217 1.0426 1.0947 1.0732 1.0626 1.0524 2.6248 6.8247 9.1606 6.8084 8.3488 9.4169 9.1540 1.0690 1.0361 1.0328 1.0334 1.0816 1.0602 1.0974 1.1029 1.0958 1.1022 1.1021 1.1068 1.1030 1.1023 1.0765 1.0655
irintensity: 0.4493 0.8252 0.0679 0.7455 1.3589 1.2023 0.5734 0.0768 0.2948 2.7360 3.5137 3.6610 4.8318 2.1358 5.1849 8.2758 5.5411 4.3624 1.3717 7.5447 2.9942 3.5303 11.6508 8.9734 22.2410 2.3591 3.0022 7.5173 3.6304 1.4560 14.6016 13.8827 18.9377 150.1556 122.4942 12.8906 12.8636 2.5934 8.1840 6.9124 3.1997 21.0283 3.0047 10.8423 1.1309 8.6277 91.7280 8.2429 4.8186 11.2927 25.4299 42.9799 76.0591 29.3343 146.2073 13.6020 18.7537 12.5202 51.8656 1.5152 8.1527 191.3082 15.8722 9.2910 98.2078 10.5337 9.6403 97.0642 6.9389 10.0014 13.3102 44.0147 142.2230 25.4235 80.4129 35.2568 44.8567 21.7733 69.7065 115.1258 9.7072 9.1906 12.3326 19.4801 13.9530 13.0077 14.1900 12.6177 44.8521 236.8425 241.3126 786.5729 117.3271 111.2885 271.5533 75.4581 19.0403 25.6936 18.1435 6.6765 19.9282 28.0252 1.3645 10.8877 6.3469 19.0118 27.2069 0.9746 0.4501 137.9868 40.5696
temp: 298.150 k
press: 1.00000 atm
elementType: 8 8 8 8 8 8 7 7 7 7 6 6 6 6 6 6 6 6 6 6 6 6 6 1 1 1 1 1 1 1 1 1 1 1 1 1 1 1 1
symmnumber: 1
zpe: 774508.7 jmol-1
zpe.correction: 0.294995 hartree
zpe.thermalcorrener: 0.317804 hartree
zpe.thermalcorrenthalpy: 0.318748 hartree
zpe.thermalcorrgfe: 0.241245 hartree
zpe.sumelectzpe: -1173.670148 hartree
zpe.sumelectthermal: -1173.647340 hartree
zpe.sumelectthermalent: -1173.646395 hartree
zpe.sumelectthermalfe: -1173.723898 hartree
dipole: 1.8648 -3.3044 -2.3502
dipole: 4.4632
quadrupole: -124.2736 -144.9951 -140.5294
quadrupole: -8.2935 -7.8225 6.5637
quadrupole: 12.3258 -8.3957 -3.9300 -8.2935 -7.8225 6.5637
hfenergy: -1173.9651432 hartree
pointgroup: C01 [X(C13H16N4O6)]
dipole: 0.5096575 -1.4387069 -0.8681777 debye
polarizability: 277.1565376|10.1732278|201.3825766|-9.7094853|-23.4688058|136.3616445 unknown
InChI: InChI=1S/C13H16N4O6/c1-4-23-12(21)6(5-18)7-10(19)15-8-9(14-7)16(2)13(22)17(3)11(8)20/h6,15,18H,4-5H2,1-3H3
charge 0 multiplicity 1
39 atoms
O  2.906033 -1.084063 -1.528659
O  2.518407 1.015928 2.265998
O  0.866172 3.117628 -1.214759
O  -3.972947 2.006575 -0.624713
O  -3.872553 -2.3201 1.227575
O  3.487662 -1.125756 0.724557
N  -1.827736 -1.281116 0.720118
N  -1.162608 2.034846 -0.723268
N  -3.927719 -0.170721 0.305744
N  0.239697 -0.204934 0.185827
C  2.40523 0.879147 -0.243008
C  0.897853 0.858521 -0.275136
C  -1.144488 -0.167362 0.217268
C  -1.859746 0.942402 -0.234041
C  0.242095 2.103979 -0.777791
C  -3.320605 0.997283 -0.21245
C  2.916676 1.655104 1.025162
C  -3.239062 -1.326553 0.779629
C  2.98707 -0.532258 -0.265932
C  -1.0628 -2.44898 1.216298
C  -5.406893 -0.226149 0.378294
C  3.420381 -2.485318 -1.694731
C  4.922465 -2.475365 -1.985515
H  2.752201 1.44074 -1.130534
H  -1.719245 2.838092 -1.048213
H  4.020608 1.742375 0.943592
H  2.479177 2.664906 1.033896
H  -1.789294 -3.167971 1.620308
H  -0.355763 -2.129893 1.997789
H  -0.49204 -2.908013 0.392685
H  -5.780128 -1.073048 -0.219626
H  -5.792984 0.725508 -0.014153
H  -5.72516 -0.372893 1.422917
H  2.90963 0.098913 2.254127
H  3.187993 -3.050446 -0.775362
H  2.833497 -2.871262 -2.542853
H  5.266135 -3.505844 -2.191672
H  5.149688 -1.853961 -2.868655
H  5.488704 -2.091843 -1.120415
