program: Gaussian 09
title: 000264169
version: EM64L-G09RevD.01
frameworkgroup: C1[X(C16H9NO6)]
method: RPBEPBE
basis: SDD
operation: Freq
keyword: #p
keyword: freq=noraman
keyword: PBEPBE/SDD
title: #p freq=noraman PBEPBE/SDD
converged: YES YES NO NO
title: Mulliken charges:
elementType: O O O O O O N C C C C C C C C C C C C C C C C H H H H H H H H H
charge: -0.237062 -0.244636 -0.243841 -0.216399 -0.196301 -0.224061 0.015442 0.478022 0.125570 0.180429 0.138698 -0.331895 0.211009 0.185092 -0.466319 0.185972 -0.527281 0.118339 -0.205174 -0.354362 -0.350235 -0.248578 -0.203743 0.272608 0.337858 0.308338 0.253185 0.253371 0.253215 0.261084 0.235159 0.236495
chargesum: 0.00000
title: Mulliken charges with hydrogens summed into heavy atoms:
elementType: O O O O O O N C C C C C C C C C C C C C C C C
charge: -0.237062 -0.244636 -0.243841 -0.216399 -0.196301 -0.224061 0.015442 0.478022 0.125570 0.180429 0.138698 -0.059287 0.211009 0.185092 -0.128461 0.185972 -0.218943 0.118339 0.301382 -0.101147 -0.089151 -0.013420 0.032752
polarizability: 4.54211203e+02 -1.26782348e+00 2.44522200e+02 -3.43080430e+00 -2.08788895e+00 8.11745622e+01
1716.lowfreq: -4.7489 -0.0008 -0.0005 0.0002 1.3508 5.1149 21.5953 36.6711 48.4947
frequency: 21.5937 36.6705 48.4917 64.6836 82.0953 89.1026 113.2289 138.8909 149.4075 191.5960 218.9640 252.4858 263.3344 290.8833 331.6332 341.1564 362.8352 383.6182 397.0974 436.1484 452.3791 479.4737 501.7515 541.7103 551.6386 575.2648 613.5943 626.8162 661.9037 668.8672 685.2746 698.4925 716.0794 735.3446 738.6529 752.2704 755.0590 768.2943 772.9281 825.9762 831.9093 851.3936 867.7419 898.5579 925.5036 938.2016 946.3937 963.5087 966.3052 976.7149 983.9191 1011.9558 1022.5602 1063.0849 1096.4700 1099.0574 1120.5107 1147.4741 1169.8711 1181.1215 1187.4662 1237.6439 1272.8317 1281.9999 1300.7932 1325.9502 1349.2033 1365.4145 1399.5380 1428.4712 1436.9167 1452.8057 1464.6129 1476.7242 1492.8306 1580.5963 1598.1232 1599.2460 1621.9360 1624.7710 1674.8431 3033.1416 3118.4385 3128.8445 3138.0189 3144.9567 3148.8152 3167.1890 3183.1932 3207.1631
redmass: 7.9067 8.5792 6.5720 2.5304 7.4815 7.4160 7.5580 7.3649 7.5908 9.5633 6.4075 8.3215 7.3463 6.0470 8.6189 10.3002 6.5642 4.2627 7.2938 3.4757 3.9839 8.7652 7.8192 6.2164 4.3531 7.0235 7.9091 8.6914 8.2953 7.9745 10.1569 10.1222 5.3742 5.0292 6.9731 1.9303 9.6104 7.4232 2.2613 7.1489 8.3926 7.1553 1.3937 1.4237 8.2834 1.4789 1.3920 1.9545 2.8050 6.4372 1.3238 3.1913 2.2823 1.4533 2.3484 4.4668 1.0371 1.9524 1.1914 6.1227 3.3069 2.5008 2.3094 1.8510 2.0298 3.5814 3.5508 1.5280 7.1505 3.0810 2.4764 2.5912 2.7530 1.3384 2.3193 7.6471 6.6761 9.0518 7.3656 7.5950 10.7865 1.0536 1.1194 1.0966 1.0868 1.0862 1.0911 1.0964 1.0981 1.0931
irintensity: 5.0970 0.4346 1.5306 10.0722 3.7459 1.2679 4.5555 2.8709 0.1302 0.2712 0.2861 0.7640 0.8833 0.2549 5.6743 0.3168 0.8177 1.3119 5.1155 1.0874 11.6308 5.2728 6.3596 21.7789 4.8186 3.9709 6.7203 4.2690 11.2721 6.1043 0.7130 3.8730 1.6138 0.1369 6.4700 37.1218 3.8683 11.9620 69.2342 52.4800 22.8403 30.8507 0.4644 27.5235 162.2406 4.7694 2.4418 145.1792 201.9425 55.8450 0.0631 96.3362 35.1368 4.4248 10.5546 5.8719 0.0103 82.6523 14.9767 359.9433 49.6807 82.9338 182.7247 14.6588 53.0857 211.6366 25.5124 22.9905 16.7420 28.4937 32.6313 63.7422 32.4000 134.1778 322.6921 101.0885 29.6376 28.2876 43.6951 36.9509 118.7085 118.0785 19.3449 46.5675 0.6999 30.9039 5.0572 19.6769 13.8947 9.5837
temp: 298.150 k
press: 1.00000 atm
elementType: 8 8 8 8 8 8 7 6 6 6 6 6 6 6 6 6 6 6 6 6 6 6 6 1 1 1 1 1 1 1 1 1
symmnumber: 1
zpe: 573253.0 jmol-1
zpe.correction: 0.218341 hartree
zpe.thermalcorrener: 0.236361 hartree
zpe.thermalcorrenthalpy: 0.237305 hartree
zpe.thermalcorrgfe: 0.170273 hartree
zpe.sumelectzpe: -1119.494654 hartree
zpe.sumelectthermal: -1119.476633 hartree
zpe.sumelectthermalent: -1119.475689 hartree
zpe.sumelectthermalfe: -1119.542722 hartree
dipole: 1.3438 -1.0595 -0.3150
dipole: 1.7400
quadrupole: -90.6710 -152.5612 -132.1475
quadrupole: -20.2087 1.7633 0.1997
quadrupole: 34.4556 -27.4347 -7.0209 -20.2087 1.7633 0.1997
hfenergy: -1119.7129947 hartree
pointgroup: C01 [X(C16H9N1O6)]
dipole: -0.5603383 0.3919943 0.0314783 debye
polarizability: 453.2386838|14.6146408|222.2190424|1.9154916|57.3268427|104.4502397 unknown
InChI: InChI=1S/C16H9NO6/c18-16-11(10-3-1-2-4-13(10)23-16)5-9-6-14-15(22-8-21-14)7-12(9)17(19)20/h1-7H,8H2
charge 0 multiplicity 1
32 atoms
O  -3.927088 2.024146 0.644586
O  -5.22988 0.155194 -0.11905
O  2.809822 2.446958 0.708961
O  0.520904 2.755888 0.939481
O  -2.055113 -3.350021 -1.902504
O  -0.099108 -2.999768 -0.80272
N  -1.288435 -2.621035 -1.157151
C  -1.013557 -0.213766 -0.232763
C  1.46416 0.610133 0.002145
C  2.88617 0.287682 -0.195395
C  -3.086462 0.978435 0.224755
C  0.442655 -0.273255 -0.314136
C  -3.85762 -0.119531 -0.224886
C  -1.834411 -1.325616 -0.674797
C  -1.698136 0.965239 0.224322
C  3.648348 1.402262 0.235286
C  -3.255554 -1.282895 -0.685564
C  1.443077 1.997511 0.584179
C  -5.320466 1.537913 0.438943
C  3.560636 -0.84968 -0.695326
C  5.043616 1.454917 0.197058
C  4.973115 -0.829055 -0.747144
C  5.704445 0.306397 -0.308524
H  0.811608 -1.228495 -0.699208
H  -1.124628 1.83245 0.563844
H  -3.824584 -2.141542 -1.043695
H  -5.834277 1.497028 1.413034
H  -5.823429 2.186919 -0.29623
H  3.009719 -1.733963 -1.033872
H  5.590865 2.336467 0.54051
H  5.512389 -1.701192 -1.130398
H  6.798316 0.297377 -0.359537
