program: Gaussian 09
title: 000264131
version: EM64L-G09RevD.01
frameworkgroup: C1[X(C13H16O3)]
method: RPBEPBE
basis: SDD
operation: Freq
keyword: #pfreq=noraman
keyword: PBEPBE/SDD
title: #p freq=noraman PBEPBE/SDD
converged: YES YES NO NO
title: Mulliken charges:
elementType: O O O C C C C C C C C C C C C C H H H H H H H H H H H H H H H H
charge: -0.207186 -0.212595 -0.267964 -0.220079 -0.453920 -0.628780 -0.313027 0.198752 0.537297 -0.595284 -0.424774 0.342642 0.178393 -0.362495 -0.793523 -0.536417 0.274091 0.228382 0.246857 0.221908 0.246985 0.219784 0.236635 0.236376 0.234458 0.237725 0.237681 0.240339 0.212957 0.219148 0.244417 0.221216
chargesum: 0.00000
title: Mulliken charges with hydrogens summed into heavy atoms:
elementType: O O O C C C C C C C C C C C C C
charge: -0.207186 -0.212595 -0.267964 0.054012 0.021319 -0.159887 0.143392 0.198752 0.537297 -0.358908 -0.190316 0.342642 0.178393 -0.124770 -0.102546 0.148364
polarizability: 1.95355307e+02 3.61867384e+00 1.41394040e+02 1.31885316e+01 -2.43331812e+00 1.07081996e+02
1716.lowfreq: -7.6146 -0.6776 0.0003 0.0005 0.0006 7.1748 20.0665 35.6133 46.8998
frequency: 18.7839 35.5086 46.8237 91.9208 102.7117 122.1838 148.0643 172.8428 193.3173 202.7809 222.0907 242.4098 263.2395 335.6283 345.2865 387.9872 444.6742 459.7172 489.3475 507.7814 533.1732 575.1846 606.2033 634.4248 653.4691 715.1897 731.6064 735.9926 794.6299 820.7791 833.7154 891.1848 902.2473 917.9063 931.5612 933.9394 959.3788 989.0446 998.7178 1002.9083 1047.3852 1065.2113 1084.8615 1112.5552 1112.8721 1129.6080 1145.9688 1153.9322 1179.2099 1184.9338 1208.2377 1218.4442 1246.8044 1253.5416 1288.2785 1296.2451 1316.0711 1324.6842 1339.8951 1383.5381 1401.9358 1415.9489 1436.6427 1456.7468 1466.1004 1466.7079 1470.2953 1473.5801 1477.6102 1483.2931 1500.2611 1592.0933 1620.4373 1699.4117 2958.4675 2972.4647 2982.6536 2993.1123 3016.1814 3018.4616 3045.7773 3052.2167 3061.0459 3090.1755 3094.7334 3110.8376 3111.8331 3117.2942 3123.2326 3158.5448
redmass: 3.8132 4.7793 4.6884 2.9740 3.2489 1.1615 3.5207 5.6048 2.7037 2.9588 3.2326 1.2298 2.6194 3.4232 3.6352 2.4352 2.9246 5.6016 4.1793 4.3374 4.4393 4.3293 3.2950 3.3987 6.6764 4.6401 4.7636 4.1009 2.1763 1.7926 1.7755 2.7911 1.4599 2.4711 2.5024 1.4516 2.1874 8.3635 2.0725 2.1392 1.5273 1.7209 3.3030 2.7430 1.2653 2.0457 1.5167 1.2249 1.4577 1.3215 1.3801 2.1371 1.4070 2.3579 1.4427 1.4546 1.3455 1.5398 1.4012 4.4441 1.3328 2.5302 1.2080 1.0456 1.0948 1.0534 1.2268 1.0940 1.1634 1.0897 2.0921 7.5428 6.1944 12.7587 1.0329 1.0810 1.0363 1.0606 1.0656 1.0622 1.1038 1.1023 1.0968 1.1004 1.0999 1.1034 1.0935 1.0896 1.0993 1.0937
irintensity: 2.8409 2.7404 1.3060 5.5345 0.9644 1.7238 2.1782 10.3067 2.2705 2.5265 1.4377 0.1729 1.9767 0.8260 1.4296 1.0585 3.4786 9.3487 3.6004 1.5475 1.8123 8.3146 8.8866 8.8963 2.5321 4.2397 6.0149 0.3988 34.9820 14.5190 0.8927 37.9330 7.4468 7.3900 33.3979 5.6021 22.9170 40.0662 10.1510 30.5734 6.4948 19.9299 167.7393 3.0047 0.2375 82.9021 4.8226 7.7546 5.4125 23.7183 4.3144 102.2713 42.3178 29.6278 7.4861 0.8432 9.2441 9.2882 3.6815 3.3967 16.9896 1.3989 7.8402 11.5309 16.1114 13.0398 43.7058 9.0196 24.7078 2.2858 98.1802 0.3359 16.7848 290.8052 70.7976 3.8845 28.9316 19.6771 15.6809 51.8861 47.3872 13.1441 17.7033 17.7706 14.2766 9.6803 40.4383 20.8908 18.7807 13.4173
temp: 298.150 k
press: 1.00000 atm
elementType: 8 8 8 6 6 6 6 6 6 6 6 6 6 6 6 6 1 1 1 1 1 1 1 1 1 1 1 1 1 1 1 1
symmnumber: 1
zpe: 687582.0 jmol-1
zpe.correction: 0.261886 hartree
zpe.thermalcorrener: 0.277582 hartree
zpe.thermalcorrenthalpy: 0.278526 hartree
zpe.thermalcorrgfe: 0.217104 hartree
zpe.sumelectzpe: -729.451887 hartree
zpe.sumelectthermal: -729.436191 hartree
zpe.sumelectthermalent: -729.435247 hartree
zpe.sumelectthermalfe: -729.496669 hartree
dipole: 4.6385 1.4320 3.1532
dipole: 5.7887
quadrupole: -112.0342 -89.2177 -93.3364
quadrupole: -17.4566 -4.7553 -4.9796
quadrupole: -13.8381 8.9784 4.8597 -17.4566 -4.7553 -4.9796
hfenergy: -729.7137728 hartree
pointgroup: C01 [X(C13H16O3)]
dipole: 1.7842404 -1.0740898 -0.9217324 debye
polarizability: 194.5690855|-10.7224685|134.7390789|-11.5999656|-13.8214116|114.523178 unknown
InChI: InChI=1S/C13H16O3/c1-9-7-10(3-4-12(9)15-2)8-11-5-6-16-13(11)14/h3-4,7,11H,5-6,8H2,1-2H3
charge 0 multiplicity 1
32 atoms
O  -4.560787 -0.472042 -0.389885
O  -4.103696 1.705404 0.28346
O  4.249516 -0.484406 -0.432152
C  -2.227426 0.147385 -0.31191
C  -2.326064 -1.396791 -0.327707
C  -1.262521 0.765577 0.733093
C  -3.756835 -1.647838 -0.854656
C  -3.684441 0.599437 -0.092706
C  0.1986 0.472139 0.424853
C  0.898766 -0.568263 1.091026
C  0.894064 1.214733 -0.557681
C  2.244608 -0.885797 0.80534
C  2.910565 -0.118902 -0.195843
C  2.241051 0.927697 -0.872838
C  2.9821 -1.993279 1.528592
C  4.991301 0.27583 -1.439573
H  -1.931811 0.511722 -1.318177
H  -2.221888 -1.786848 0.701463
H  -1.557315 -1.874478 -0.955406
H  -1.532335 0.3782 1.733968
H  -1.448378 1.856054 0.753479
H  -3.804075 -1.667293 -1.9587
H  -4.243967 -2.544798 -0.443358
H  0.382788 -1.147765 1.867911
H  0.386961 2.037223 -1.077923
H  2.754103 1.525799 -1.632112
H  3.35688 -2.753071 0.818315
H  3.870772 -1.600675 2.056228
H  2.327502 -2.49045 2.264577
H  4.52481 0.182066 -2.439809
H  5.99602 -0.171666 -1.45583
H  5.064125 1.346194 -1.16454
