program: Gaussian 09
title: 000264266
version: EM64L-G09RevD.01
frameworkgroup: C1[X(C27H24O2)]
method: RPBEPBE
basis: SDD
operation: Freq
keyword: #pfreq=noraman
keyword: PBEPBE/SDD
title: #p freq=noraman PBEPBE/SDD
converged: YES YES NO NO
title: Mulliken charges:
elementType: O O C C C C C C C C C C C C C C C C C C C C C C C C C C C H H H H H H H H H H H H H H H H H H H H H H H H
charge: -0.291870 -0.444384 -0.010072 -0.087413 0.293607 0.340226 -0.226087 0.436549 0.392405 0.462419 -0.434195 -0.432442 0.026588 -0.445149 -0.447276 -0.442120 -0.350589 -0.244366 -0.223919 -0.362953 -0.378858 -0.673465 -0.694051 -0.248668 -0.253774 -0.256729 -0.244536 -0.244871 -0.248724 0.260061 0.265290 0.353838 0.216211 0.240791 0.239456 0.250896 0.277673 0.225540 0.225153 0.238014 0.281553 0.207817 0.230999 0.223603 0.200996 0.226082 0.222948 0.223631 0.228328 0.222420 0.223361 0.226749 0.223308
chargesum: 0.00000
title: Mulliken charges with hydrogens summed into heavy atoms:
elementType: O O C C C C C C C C C C C C C C C C C C C C C C C C C C C
charge: -0.291870 -0.090546 -0.010072 -0.087413 0.293607 0.340226 -0.226087 0.436549 0.392405 0.462419 -0.174134 -0.167152 0.242799 -0.204358 -0.207819 -0.191224 -0.072916 -0.018826 0.001234 -0.124939 -0.097306 -0.011047 -0.044026 -0.025037 -0.025446 -0.034309 -0.021176 -0.018121 -0.025415
polarizability: 3.44597531e+02 4.60335785e+00 3.18511552e+02 -4.73331057e+00 1.12295556e+01 2.15915439e+02
1716.lowfreq: -10.1176 -0.0005 0.0001 0.0006 4.4534 6.6887 22.6778 44.3264 52.6064
frequency: 22.5000 44.3112 52.5965 57.3098 64.4907 69.9051 74.8996 89.2637 105.0062 156.3965 176.3139 184.2903 200.3006 206.9821 232.3126 236.9522 244.8481 245.5977 257.3539 268.1433 275.1979 289.2411 297.4516 313.1934 336.0579 385.8925 406.4719 411.5291 431.7218 450.5883 456.4445 467.9587 481.4858 497.8556 512.2962 520.1401 543.4750 589.1562 616.1939 616.8551 636.3972 637.7165 643.0067 665.7741 680.1370 704.1987 709.8571 736.1765 752.2712 774.3951 781.3915 793.0595 796.6283 808.2470 838.4948 842.3519 857.9660 864.8295 886.0003 899.6398 914.4358 919.0685 919.8399 931.2695 937.7987 941.1232 951.0123 960.2069 965.6810 979.7729 982.5872 987.4249 989.3947 990.2944 992.0148 996.9970 1001.4282 1010.3489 1023.0195 1032.0808 1033.7801 1051.2462 1080.0040 1087.4915 1105.6969 1109.2465 1148.1372 1161.6502 1170.8524 1171.3197 1172.0533 1177.8521 1181.3034 1189.7325 1192.6091 1220.4320 1233.1085 1245.9413 1260.9130 1312.1283 1317.6995 1318.6514 1334.8975 1335.3142 1367.0560 1373.0258 1378.5486 1382.1553 1389.6773 1390.8309 1415.4248 1434.3933 1435.2377 1454.0751 1461.4771 1464.6954 1465.7143 1466.7486 1479.9356 1485.0021 1485.4593 1498.6729 1587.3818 1590.5290 1599.8469 1603.7347 1611.3702 1614.7029 1628.4067 2981.0889 2982.7428 2989.2982 3076.1668 3088.4927 3093.1867 3098.3438 3117.9056 3118.9432 3123.5282 3125.0656 3126.8036 3131.4374 3137.4744 3139.3383 3143.9344 3147.8194 3154.2628 3155.6199 3160.3207 3161.0931 3166.3623 3177.0921 3547.8675
redmass: 4.9373 4.1244 2.7444 4.6402 4.7461 3.6932 4.6767 3.8494 3.9444 4.4580 4.0049 4.2930 1.0690 2.7978 3.1205 1.7592 1.9976 3.1362 1.8447 3.7863 5.1756 4.5746 3.9841 3.7408 4.9169 2.6831 2.8718 2.9230 4.0359 4.2111 3.5234 3.3201 3.8228 4.6162 3.8902 6.1276 7.1740 4.2236 6.4001 6.4028 4.8923 5.9650 6.3596 3.8798 5.1870 1.8414 2.1414 1.9727 1.8820 1.3328 3.3295 2.4228 4.2506 3.7415 3.2570 2.6245 1.2517 1.2562 2.3697 2.6167 1.3238 2.7225 1.5237 1.5846 1.3981 1.7091 2.0960 5.4481 5.0029 1.3927 1.3786 1.4095 1.7921 2.7566 5.9399 1.3188 1.3378 4.7779 2.9132 2.1742 2.0717 1.8912 1.7645 1.6395 1.8680 2.4100 2.1395 1.6912 1.0604 1.0705 1.2320 2.0238 1.2801 1.1224 1.1397 1.9694 1.9146 2.1645 2.9076 1.6474 1.3152 1.3623 1.3607 1.6103 2.7660 1.2614 7.5987 8.8487 1.2241 5.6086 1.8159 2.2485 2.2367 1.0542 2.2215 1.5916 2.7099 1.0597 2.1492 2.2810 1.0934 4.3460 6.1174 6.2322 6.7945 7.5535 6.0654 6.0518 7.8243 1.0644 1.0535 1.0364 1.0983 1.0994 1.1004 1.0999 1.0849 1.0846 1.0859 1.0863 1.0877 1.0893 1.0922 1.0931 1.0929 1.0945 1.0965 1.0982 1.0978 1.0974 1.0987 1.0955 1.0659
irintensity: 0.2509 0.0664 0.0608 0.2118 0.6293 0.3483 0.2171 0.0432 0.3006 3.8688 2.4268 1.4301 0.1357 11.9687 15.3245 47.0798 26.3498 5.0396 13.3512 15.9482 1.0086 39.2751 4.1211 16.6878 14.9297 0.6003 0.0639 0.6204 2.6259 1.3766 2.8040 0.1987 3.7365 2.5046 0.4852 1.1163 4.3993 5.3867 0.4538 0.0510 8.8263 6.4064 11.3886 13.2065 5.4076 53.1186 21.4662 74.9419 39.8093 1.6629 18.4092 42.0881 6.7931 13.7013 2.2827 84.0034 1.4601 0.9457 3.6304 1.8931 0.7857 13.2433 1.8028 0.7573 2.4487 0.6220 12.1800 132.2551 2.2658 0.0706 0.4793 0.9090 0.5191 1.2803 0.0264 0.0286 0.7926 18.3050 1.7993 11.6217 4.7504 1.8920 1.6595 7.9523 71.7742 4.4677 14.0565 33.7362 0.1554 0.3132 0.4832 14.5405 8.4506 4.5284 4.2328 8.0471 9.5740 8.5361 37.5139 18.8901 4.6519 2.4077 20.2399 28.7307 10.2940 24.9341 0.9809 1.5480 24.2254 3.9214 0.2127 11.0706 12.7714 3.7623 0.2890 2.2893 5.5981 12.7963 9.7629 16.5708 20.8632 9.9354 0.2175 0.2876 1.7669 3.5519 2.5074 1.6039 1.1365 23.9120 16.3742 26.7061 23.7789 45.0934 17.4042 38.8910 4.3803 0.0644 0.7687 1.3847 3.9488 14.4547 36.3528 9.0397 30.3838 47.8386 30.0505 36.9797 12.3444 25.8656 13.9213 5.3720 9.0875
temp: 298.150 k
press: 1.00000 atm
elementType: 8 8 6 6 6 6 6 6 6 6 6 6 6 6 6 6 6 6 6 6 6 6 6 6 6 6 6 6 6 1 1 1 1 1 1 1 1 1 1 1 1 1 1 1 1 1 1 1 1 1 1 1 1
symmnumber: 1
zpe: 1121162.1 jmol-1
zpe.correction: 0.427028 hartree
zpe.thermalcorrener: 0.451863 hartree
zpe.thermalcorrenthalpy: 0.452807 hartree
zpe.thermalcorrgfe: 0.373260 hartree
zpe.sumelectzpe: -1191.696534 hartree
zpe.sumelectthermal: -1191.671699 hartree
zpe.sumelectthermalent: -1191.670755 hartree
zpe.sumelectthermalfe: -1191.750302 hartree
dipole: -2.0533 -1.8522 1.1928
dipole: 3.0116
quadrupole: -151.2503 -158.6622 -167.7968
quadrupole: -0.3345 1.3307 3.5026
quadrupole: 7.9861 0.5742 -8.5604 -0.3345 1.3307 3.5026
hfenergy: -1192.1235621 hartree
pointgroup: C01 [X(C27H24O2)]
dipole: 0.063477 1.0566387 -0.5322907 debye
polarizability: 321.5818828|-11.2376307|337.6190467|23.7889612|-4.8786351|219.8235924 unknown
InChI: InChI=1S/C27H24O2/c1-19(2)29-27(22-15-7-4-8-16-22)24-18-10-12-20-11-9-17-23(25(20)24)26(27,28)21-13-5-3-6-14-21/h3-19,28H,1-2H3
charge 0 multiplicity 1
53 atoms
O  0.612856 -0.318904 -1.390456
O  -0.271406 -0.452974 2.217377
C  0.60013 0.336036 -0.050388
C  -0.545177 -0.52033 0.763197
C  -0.045598 1.725246 -0.155137
C  -1.818269 0.288738 0.488485
C  -1.449002 1.594451 0.06217
C  1.964344 0.244513 0.628211
C  -0.588417 -2.001848 0.418953
C  -2.382946 2.659879 -0.109831
C  0.459325 2.974675 -0.522626
C  -3.162099 0.003893 0.724201
C  1.060826 0.447436 -2.588404
C  -1.837636 3.930552 -0.497941
C  -3.762826 2.345366 0.133104
C  2.414814 1.228656 1.544422
C  2.777654 -0.893842 0.396415
C  -0.454277 4.073955 -0.68391
C  -4.129862 1.048794 0.528324
C  -1.288692 -2.458219 -0.725541
C  0.078357 -2.945096 1.238978
C  2.577529 0.717607 -2.603148
C  0.614663 -0.424846 -3.770542
C  3.656285 1.08555 2.20481
C  4.01572 -1.038971 1.055716
C  -1.321767 -3.832018 -1.045516
C  0.044129 -4.320969 0.919517
C  4.462644 -0.049217 1.962857
C  -0.654552 -4.770963 -0.223785
H  1.528691 3.132463 -0.699922
H  -3.481265 -0.987382 1.061643
H  -0.221215 0.499172 2.490735
H  0.513263 1.411244 -2.614356
H  -2.504137 4.788821 -0.643831
H  -4.528287 3.120947 0.012281
H  1.800956 2.115842 1.739125
H  2.428929 -1.65246 -0.310656
H  -0.050799 5.051169 -0.972882
H  -5.187545 0.824541 0.708122
H  -1.793239 -1.732696 -1.371401
H  0.602119 -2.591642 2.130967
H  2.847488 1.246278 -3.537034
H  2.898355 1.339715 -1.750487
H  3.141722 -0.230577 -2.562752
H  0.883654 0.059036 -4.727278
H  -0.477474 -0.580016 -3.746957
H  1.105303 -1.413301 -3.724636
H  3.991655 1.857421 2.907153
H  4.631452 -1.92532 0.864825
H  -1.865522 -4.170759 -1.934929
H  0.559999 -5.040082 1.56615
H  5.425232 -0.161544 2.474599
H  -0.682887 -5.83872 -0.47049
