program: Gaussian 09
title: 000264118
version: EM64L-G09RevD.01
frameworkgroup: C1[X(C7H8O5)]
method: RPBEPBE
basis: SDD
operation: Freq
keyword: #p
keyword: freq=noraman
keyword: PBEPBE/SDD
title: #p freq=noraman PBEPBE/SDD
converged: YES YES NO NO
title: Mulliken charges:
elementType: O O O O O C C C C C C C H H H H H H H H
charge: -0.194113 -0.246750 -0.097287 -0.226554 -0.157893 -0.325095 -0.336112 0.049241 0.263560 0.168207 -0.260042 -0.660068 0.318445 0.277318 0.246061 0.240930 0.236222 0.225957 0.230185 0.247787
chargesum: 0.00000
title: Mulliken charges with hydrogens summed into heavy atoms:
elementType: O O O O O C C C C C C C
charge: -0.194113 -0.246750 -0.097287 -0.226554 -0.157893 -0.006650 0.187268 0.049241 0.263560 0.168207 0.217111 0.043859
polarizability: 1.18062988e+02 3.97657467e+00 8.68863410e+01 2.20512129e+00 2.54056508e-01 6.28572860e+01
1716.lowfreq: -2.0767 -0.0012 -0.0011 -0.0011 1.3574 8.1786 33.0897 36.2029 60.6597
frequency: 33.0529 36.1642 60.6472 82.7988 141.6402 150.6923 187.4852 238.9754 297.9030 315.8315 322.1418 387.6525 433.2892 531.2018 560.5342 604.6885 655.1549 677.2663 702.4412 781.2619 804.1341 816.6614 879.1915 927.4122 967.0143 999.5647 1017.0858 1076.6940 1096.0897 1112.6213 1131.3839 1160.1685 1176.4462 1205.1442 1276.3194 1282.5326 1342.9308 1357.1353 1393.4095 1459.2741 1464.7593 1479.7716 1484.2079 1633.4085 1683.0391 1694.7630 2995.6369 3023.8363 3038.4480 3052.0647 3091.5411 3098.3019 3126.7860 3133.4591
redmass: 4.5178 5.3132 3.9128 5.9255 5.9511 5.8531 1.7834 1.4884 5.9361 3.6760 9.8175 9.3161 3.5262 7.5197 5.5264 8.8098 8.6603 5.8301 4.7546 2.8535 2.4618 2.0074 3.6517 10.9955 5.1606 2.1448 2.0032 3.7687 2.1949 2.8333 3.9644 1.7501 1.2568 1.3533 1.1504 1.7099 1.3277 1.3064 1.2305 1.0936 1.0444 1.0822 1.0531 8.7954 12.9873 12.8912 1.0360 1.0827 1.0601 1.0594 1.0974 1.1026 1.1074 1.1097
irintensity: 0.4685 1.1571 2.6103 0.9671 0.9856 6.6527 4.7557 0.6740 10.7047 17.7761 0.7757 14.3120 2.9833 3.1350 1.3402 3.2231 3.9824 12.8602 7.6874 5.4494 1.4615 9.7306 35.6872 46.3196 77.0164 31.9480 20.2133 37.9573 31.2589 137.6319 181.9845 36.4076 44.4476 160.4095 4.8771 168.9213 10.6550 10.0154 21.8609 14.6345 14.4773 11.7631 13.4816 197.0021 49.2835 280.7170 15.2802 3.7662 20.1351 14.5303 29.2960 3.5641 24.4126 6.6236
temp: 298.150 k
press: 1.00000 atm
elementType: 8 8 8 8 8 6 6 6 6 6 6 6 1 1 1 1 1 1 1 1
symmnumber: 1
zpe: 380903.3 jmol-1
zpe.correction: 0.145078 hartree
zpe.thermalcorrener: 0.157022 hartree
zpe.thermalcorrenthalpy: 0.157967 hartree
zpe.thermalcorrgfe: 0.105076 hartree
zpe.sumelectzpe: -646.734363 hartree
zpe.sumelectthermal: -646.722419 hartree
zpe.sumelectthermalent: -646.721474 hartree
zpe.sumelectthermalfe: -646.774365 hartree
dipole: -5.6593 -2.1801 -2.3188
dipole: 6.4928
quadrupole: -76.6288 -72.9475 -68.7155
quadrupole: -6.5176 -1.3409 2.7278
quadrupole: -3.8648 -0.1836 4.0484 -6.5176 -1.3409 2.7278
hfenergy: -646.8794409 hartree
pointgroup: C01 [X(C7H8O5)]
dipole: 2.2299904 -1.0284257 0.7034414 debye
dipolederiv: -0.6830919 0.0488521 -0.0125023 0.4919333 -1.0122979 -0.0236478 -0.0289551 -0.0664314 -0.2802498 -1.4506772 -0.243447 -0.2200952 -0.5318393 -0.4210297 -0.175092 -0.3097903 -0.1552776 -0.5590261 -0.3611364 -0.0894751 -0.0278467 0.1928602 -0.8028102 -0.0603979 -0.0192782 -0.0181213 -0.2580701 -0.673996 0.0029165 0.1325241 -0.1850339 -0.3668401 -0.1315095 0.0000498 -0.2876132 -0.8417897 -0.9676218 0.3519433 -0.0099182 0.1834235 -0.5967039 -0.0143859 -0.0592198 0.0082171 -0.3011643 -0.9507857 0.2783006 0.0986656 0.1891736 -0.3248984 -0.0317291 0.0245437 0.0785991 -0.0059222 0.553143 -0.162467 -0.0107963 -0.0142317 0.3889387 -0.0349494 0.1418963 -0.0470173 0.2556807 0.7152483 -0.1640008 0.0773158 -0.5944331 1.0023173 0.0568918 0.1334275 -0.0558535 0.2015799 1.7727958 0.1792273 -0.0251635 0.6885909 0.3369911 0.3341576 0.2020891 0.45978 1.142204 1.0318171 -0.339238 0.0213119 -0.5346689 1.2752935 0.0380437 0.0238831 0.0741139 0.2933078 0.9077747 0.0778491 0.0399726 0.128296 0.3438463 0.0314012 -0.1561757 -0.0514773 0.2268007 -0.1580672 0.0541859 -0.0078911 0.0498834 -0.0851322 -0.0182125 0.0454504 0.0281384 0.0599579 0.1384444 -0.0031632 -0.0243821 -0.0297321 0.0963465 -0.0063619 -0.0041889 -0.0296101 0.0208741 0.0495961 0.0820657 0.027231 0.0246192 0.0936104 0.001532 0.0165142 -0.0577478 -0.014867 0.029477 0.0266902 -0.0018254 -0.0012548 -0.0343481 0.0648749 -0.0246505 0.1165578 0.0469562 -0.0167356 0.0224995 -0.0603177 0.0138187 0.0587239 0.0258699 0.0370669 0.0983261 -0.0559454 -0.0154046 -0.016301 -0.0084542 -0.0481485 -0.0547762 -0.0751709 -0.0051947 -0.1081303 0.0504117 -0.139755 -0.0612056 0.055756 -0.0456149 0.0815415 0.040336 0.0685651 0.0313097 0.0970334 0.1146938 0.017803 0.0093939 0.0408614 0.0613948 0.0496128 -0.0400027 0.0745954 -0.1146893 0.1042812 -0.0630354 -0.0529783 -0.0185029 -0.0401674 -0.0712632 -0.04603 -0.0923578 0.0369171 unknown
polarizability: 118.0971808|-4.2296655|85.7797569|1.3375853|4.9573896|63.9296772 unknown
InChI: InChI=1S/C7H8O5/c1-2-11-6(9)4-3-12-7(10)5(4)8/h4H,2-3H2,1H3
charge 0 multiplicity 1
20 atoms
O  -2.364833 -1.337683 -0.161509
O  2.088729 0.320074 0.580002
O  -0.851391 1.864891 0.315189
O  1.457762 -0.640539 -1.458342
O  -3.583107 0.65076 -0.104489
C  -0.125721 -0.537726 0.428849
C  -0.918365 -1.743279 -0.121341
C  -1.098512 0.651279 0.245864
C  1.210537 -0.318525 -0.2737
C  -2.504665 0.050577 -0.027323
C  3.427599 0.705165 0.014899
C  4.422885 -0.447302 0.159728
H  0.06198 -0.623694 1.515565
H  -0.611251 -1.982431 -1.152239
H  -0.868816 -2.637233 0.515775
H  3.286925 0.993642 -1.040988
H  3.709939 1.582883 0.616344
H  5.420255 -0.115805 -0.183211
H  4.510474 -0.765612 1.212655
H  4.119975 -1.311445 -0.454925
