program: Gaussian 09
title: 000023041
version: EM64L-G09RevD.01
frameworkgroup: C1[X(C9H14NO)]
method: RPBEPBE
basis: SDD
operation: Freq
keyword: #p
keyword: freq=noraman
keyword: PBEPBE/SDD
title: #p freq=noraman PBEPBE/SDD
converged: NO YES NO NO
title: Mulliken charges:
elementType: O N C C C C C C C C C H H H H H H H H H H H H H H
charge: -0.394119 -0.231674 0.521461 -0.554521 -0.554537 -0.594226 -0.295493 -0.318162 -0.398837 -0.353553 0.304089 0.270394 0.281852 0.258881 0.270473 0.258883 0.281825 0.277776 0.265146 0.277784 0.240639 0.263177 0.255124 0.285592 0.382026
chargesum: 1.00000
title: Mulliken charges with hydrogens summed into heavy atoms:
elementType: O N C C C C C C C C C
charge: -0.012093 -0.231674 0.521461 0.256606 0.256644 0.226480 -0.054854 -0.054985 -0.143713 -0.067961 0.304089
polarizability: 1.41402623e+02 1.33243437e+00 1.01404996e+02 1.23446656e-04 -4.38551533e-04 6.27535030e+01
1716.lowfreq: -15.3009 -12.2996 -6.4655 -0.0005 -0.0005 0.0005 48.4774 92.4824 168.8646
frequency: 48.4541 92.4822 168.8331 214.6359 243.0295 247.9134 301.2278 341.4727 342.3922 376.1714 399.6723 410.5085 420.0739 446.1978 469.2524 511.1948 538.2834 630.3998 645.6024 709.3025 804.4096 806.3714 826.3435 832.4576 913.5162 936.0236 937.9680 959.9975 993.1532 1042.9980 1094.0164 1103.0150 1103.4713 1123.3723 1151.6769 1196.3907 1215.0953 1221.2350 1249.8802 1283.8931 1324.1690 1402.0750 1418.3573 1421.0282 1434.8257 1449.6963 1455.0100 1462.2954 1467.2599 1476.9559 1486.0639 1499.2589 1503.7684 1595.8891 1624.2383 3027.8999 3029.7261 3034.4033 3137.1308 3142.7307 3144.5017 3150.9801 3155.3117 3156.4762 3161.3055 3165.1233 3173.9730 3191.6641 3576.2995
redmass: 3.1754 3.7968 1.1254 2.5821 3.1047 1.1757 3.4900 3.0939 1.0695 2.7150 3.3823 1.9099 1.4389 3.0033 3.1192 3.3294 2.4737 6.9916 4.6813 3.8384 1.2932 4.1485 4.6461 1.5937 2.5740 2.7031 1.3875 1.3446 3.3170 1.1915 1.4097 2.6576 1.3060 1.4020 1.2422 1.1240 1.8785 1.8256 1.9211 2.6982 1.3315 5.6165 1.1519 1.1360 3.2245 1.0490 1.1526 1.0426 1.0906 1.0530 1.0462 1.9885 1.1455 6.7238 6.1484 1.0322 1.0324 1.0329 1.0887 1.1053 1.1054 1.1051 1.1053 1.0983 1.1056 1.1037 1.0888 1.0972 1.0667
irintensity: 0.2593 1.5946 0.0299 0.6728 0.0087 0.1040 4.4290 0.6512 0.8142 1.6196 10.7307 52.0280 97.1104 5.8986 4.1327 1.2540 55.0792 0.6619 3.8135 0.0111 11.5654 33.8572 6.0367 50.0772 22.0007 16.6494 0.8418 0.0145 5.8625 0.0398 29.9019 1.0838 0.4334 134.1253 118.5005 15.6892 0.0042 1.7304 3.1877 50.7319 8.6885 18.6462 16.9786 17.3456 11.5546 0.1881 4.1424 2.0445 4.4810 43.8830 35.4885 166.9121 12.7579 16.3360 60.4331 2.4519 5.2616 3.7434 10.3661 0.1865 0.6466 15.7676 0.8677 0.5204 1.4328 5.1745 1.5774 0.3219 98.0346
temp: 298.150 k
press: 1.00000 atm
elementType: 8 7 6 6 6 6 6 6 6 6 6 1 1 1 1 1 1 1 1 1 1 1 1 1 1
symmnumber: 1
zpe: 565958.1 jmol-1
zpe.correction: 0.215562 hartree
zpe.thermalcorrener: 0.226657 hartree
zpe.thermalcorrenthalpy: 0.227601 hartree
zpe.thermalcorrgfe: 0.179485 hartree
zpe.sumelectzpe: -480.225199 hartree
zpe.sumelectthermal: -480.214104 hartree
zpe.sumelectthermalent: -480.213159 hartree
zpe.sumelectthermalfe: -480.261275 hartree
dipole: 5.9385 -1.6274 -0.0003
dipole: 6.1574
quadrupole: -29.6746 -50.2167 -62.7067
quadrupole: 8.1161 -0.0001 -0.0005
quadrupole: 17.8581 -2.6841 -15.1740 8.1161 -0.0001 -0.0005
hfenergy: -480.4407608 hartree
pointgroup: C01 [X(C9H14N1O1)]
dipole: -2.3426173 -0.6170643 -0.0029237 debye
dipolederiv: -1.5764186 0.0620573 0.0002189 0.0642167 -0.0586378 0.0016159 0.0001869 0.0016127 -0.405463 -0.2495609 0.0118877 0.0000381 -0.0411777 -0.2954625 -0.0002912 -0.0002484 -0.0002999 -0.2274396 0.3682751 0.0175961 0.0001662 0.0086464 -0.0934281 0.0003033 0.0000945 0.0003327 -0.1586139 0.0339305 0.0428638 -0.0824821 0.0698536 0.1022735 -0.104797 -0.1442099 -0.1005414 0.2439636 0.0338554 0.0420603 0.0828986 0.0683762 0.1001968 0.1033447 0.1449591 0.099108 0.2461138 0.0900538 -0.0757208 -0.0004071 -0.1447992 0.2773577 0.0010972 -0.0007299 0.0010961 0.0591976 0.0959886 -0.0635982 -0.0002912 -0.0639911 0.0469301 0.0005056 -0.0003043 0.0004394 -0.0880823 0.1281949 0.0368883 0.0001495 0.1110789 0.0543144 0.0008097 0.0005016 0.0008323 -0.1037568 -0.3740964 0.0080079 0.0000435 -0.3433676 0.0372449 0.0008906 -0.0015196 0.0009662 -0.1645826 -0.3396784 0.0310636 0.0001489 0.3524739 0.0382294 0.0007894 0.001642 0.0007517 -0.1285896 1.6412242 -0.067999 -0.0002382 -0.0467076 0.0534349 -0.0003316 -0.0001927 -0.0003534 0.1251934 0.1253721 0.0842948 0.0157423 0.0608507 -0.0132451 0.0109765 0.0164609 -0.0423911 0.0870901 0.1124941 -0.0504226 -0.0439272 -0.0416915 0.0521633 -0.0719078 -0.0374554 -0.0227003 0.0346757 -0.094395 -0.0058874 0.0090208 0.0215311 0.1223304 0.0252333 -0.0249762 0.0234353 0.0816753 0.1252934 0.0843954 -0.0149157 0.0610201 -0.0134988 -0.0120028 -0.0158458 0.0413585 0.0874356 -0.0943735 -0.0057942 -0.00907 0.0212311 0.1228146 -0.0248356 0.0251754 -0.0230337 0.0811424 0.1125155 -0.0508863 0.0433921 -0.0420628 0.0511759 0.0721235 0.0369947 0.0228759 0.0356397 0.1210864 -0.0383987 0.0730676 0.0001015 0.0648111 0.0202419 0.0667417 0.0451369 0.0062751 -0.0580449 -0.0039879 0.0000019 -0.0864867 0.0848577 -0.0002176 -0.0004114 -0.0002263 0.1306263 0.1210549 -0.0376916 -0.0734672 0.0007468 0.0654579 -0.0196617 -0.0667735 -0.0445227 0.0056871 0.034893 -0.0952376 -0.0004271 -0.1122927 0.0170808 -0.0005619 -0.0005018 -0.0005139 0.148157 0.0856065 0.0744717 0.0003541 0.0909708 0.0185378 -0.0006112 0.0004317 -0.0006481 0.1485317 0.011556 0.0679248 0.0002971 0.0578327 0.01309 -0.0007271 0.0002618 -0.000733 0.1754169 0.0682397 -0.0340059 -0.0001613 -0.032037 0.0490044 -0.0005902 -0.0001378 -0.000591 0.1755083 0.4769335 -0.0338814 -0.0001525 -0.0343167 0.1029667 -0.0013961 -0.0001435 -0.0013909 0.4041984 unknown
polarizability: 141.3722433|-1.7290485|101.4345743|0.0005523|0.1759243|62.754304 unknown
InChI: InChI=1S/C9H14NO/c1-10(2,3)8-4-6-9(11)7-5-8/h4-7,11H,1-3H3
charge 1 multiplicity 1
25 atoms
O  3.764953 0.041187 0.000481
N  -1.968641 0.005701 -0.000195
C  -0.437433 0.021105 -0.000025
C  -2.480686 -0.722403 1.251351
C  -2.480805 -0.709577 -1.259115
C  -2.567312 1.411579 0.006949
C  0.244589 -1.218187 -0.005509
C  0.286785 1.234703 0.005737
C  1.650921 -1.247051 -0.005451
C  1.69254 1.207176 0.005717
C  2.381837 -0.029819 0.000076
H  -2.114471 -1.757717 1.247836
H  -2.097139 -0.200583 2.140193
H  -3.582061 -0.714789 1.243862
H  -2.114533 -1.744806 -1.266342
H  -3.582177 -0.702061 -1.251373
H  -2.097458 -0.178561 -2.142592
H  -2.24526 1.953896 -0.893523
H  -3.663342 1.313817 0.006655
H  -2.244826 1.944894 0.912629
H  -0.288292 -2.175019 -0.00963
H  -0.20515 2.209788 0.010442
H  2.170572 -2.211802 -0.009721
H  2.272463 2.133606 0.010066
H  4.202424 -0.847177 -0.003619
