program: Gaussian 09
title: 000264125
version: EM64L-G09RevD.01
frameworkgroup: C1[X(C13H12N2O6)]
method: RPBEPBE
basis: SDD
operation: Freq
keyword: #p
keyword: freq=noraman
keyword: PBEPBE/SDD
title: #p freq=noraman PBEPBE/SDD
converged: YES YES NO NO
title: Mulliken charges:
elementType: O O O O O O N N C C C C C C C C C C C C C H H H H H H H H H H H H
charge: -0.237121 -0.225494 -0.181530 -0.192505 -0.191795 -0.189618 0.015374 0.023813 0.349821 -0.620945 0.211221 -0.694064 -0.719276 0.138846 -0.347256 0.325334 0.235572 -0.276367 -0.523509 -0.409712 0.427452 0.255485 0.252127 0.238025 0.217255 0.243895 0.215162 0.232341 0.240556 0.259677 0.293094 0.335086 0.299053
chargesum: 0.00000
title: Mulliken charges with hydrogens summed into heavy atoms:
elementType: O O O O O O N N C C C C C C C C C C C C C
charge: -0.237121 -0.225494 -0.181530 -0.192505 -0.191795 -0.189618 0.015374 0.023813 0.349821 -0.113332 0.211221 0.005112 -0.031216 0.138846 -0.087580 0.325334 0.235572 0.016727 -0.188423 -0.110659 0.427452
polarizability: 3.24504439e+02 -6.85894626e+00 1.89904375e+02 1.13572838e+01 3.32434465e+00 9.84645358e+01
1716.lowfreq: -4.3965 -0.0007 -0.0005 -0.0001 3.9490 7.7860 15.6612 28.3693 41.8451
frequency: 15.6470 28.3610 41.8343 49.3401 57.5866 89.8705 101.3247 136.2347 152.1013 165.6826 195.3361 203.0118 243.9876 250.9700 287.1513 298.4741 322.9138 330.7717 341.5259 366.1997 385.8774 402.2245 438.2984 441.6445 494.8941 504.5492 521.5320 565.9209 573.5598 626.2825 645.9568 667.8923 678.5049 703.8456 716.7359 722.1671 743.2791 758.4662 789.8521 825.5973 843.5400 854.3058 875.4311 890.4827 915.3484 942.1047 962.7911 967.9270 988.1535 1008.3211 1027.4651 1052.7933 1106.2910 1111.7707 1139.0716 1159.7745 1166.3129 1194.8630 1209.2798 1222.4224 1241.9588 1264.9885 1281.5359 1299.8096 1345.7277 1356.2176 1379.4219 1384.2752 1398.9135 1402.5024 1418.4356 1445.4728 1457.2831 1464.7378 1469.9143 1472.4443 1485.5600 1577.3027 1605.0787 1651.3041 1657.5380 2984.9450 2989.9159 2994.2020 3074.0980 3086.0358 3091.6235 3101.3056 3105.1375 3120.1808 3184.4091 3192.0463 3209.8460
redmass: 7.5321 5.1341 6.4416 12.1842 12.1224 4.4788 5.2324 7.7935 7.9468 5.0582 1.7372 1.6865 1.2550 4.3832 7.2323 2.5870 6.7869 2.8512 5.1577 3.8866 5.0610 4.2500 3.0364 3.8047 8.1974 4.1552 4.0397 4.3011 6.3336 7.3831 6.6866 7.2538 5.2112 6.7672 7.6311 6.5928 5.4174 12.6268 3.9486 3.1482 1.6543 2.8234 3.4898 2.8239 1.8033 1.3916 1.4447 1.7308 1.3788 1.4161 5.3612 2.2212 3.4872 1.3524 2.0081 2.1855 2.1800 9.8077 4.9164 4.0360 2.0177 2.4271 1.6073 1.9719 2.4237 6.4637 4.7787 1.2477 1.3080 2.9377 5.5387 1.0749 1.0642 1.0509 2.7169 1.0681 1.0529 8.8499 7.0059 11.4588 9.7439 1.0639 1.0364 1.0374 1.0974 1.0998 1.0992 1.1005 1.0998 1.0880 1.0910 1.0921 1.0956
irintensity: 3.5325 0.5921 0.8703 0.6193 1.3549 0.7116 0.5177 6.1634 5.1942 5.1374 0.5123 0.1271 0.4912 0.0098 3.2888 4.8023 1.3944 0.8442 2.2467 0.3785 0.4494 1.5613 2.7093 3.4213 3.6645 2.8998 14.9648 1.7147 8.2520 1.7036 10.9457 5.2616 21.7504 26.1597 1.1328 10.3546 2.6546 22.1930 2.2683 6.7187 17.8194 65.3522 10.9701 22.1124 7.7444 2.3365 26.2094 4.3912 4.4045 9.8076 330.5160 74.6283 7.1208 23.9148 110.1711 37.2011 37.7624 338.0197 164.9812 97.9337 32.1733 47.8576 4.2053 57.5216 81.4372 121.3169 50.7779 29.1321 29.7984 17.1011 29.8809 8.9486 8.1843 4.4959 33.1138 6.4993 11.6106 24.7221 54.5758 139.2300 51.5013 11.8613 9.6404 20.6746 6.1582 16.9384 30.0293 8.6463 34.2890 2.4390 3.6940 23.0411 0.7830
temp: 298.150 k
press: 1.00000 atm
elementType: 8 8 8 8 8 8 7 7 6 6 6 6 6 6 6 6 6 6 6 6 6 1 1 1 1 1 1 1 1 1 1 1 1
symmnumber: 1
zpe: 620371.5 jmol-1
zpe.correction: 0.236287 hartree
zpe.thermalcorrener: 0.255533 hartree
zpe.thermalcorrenthalpy: 0.256477 hartree
zpe.thermalcorrgfe: 0.186292 hartree
zpe.sumelectzpe: -1061.735129 hartree
zpe.sumelectthermal: -1061.715883 hartree
zpe.sumelectthermalent: -1061.714939 hartree
zpe.sumelectthermalfe: -1061.785125 hartree
dipole: -6.7859 0.9712 -3.5476
dipole: 7.7186
quadrupole: -128.9690 -140.9824 -117.9102
quadrupole: -6.3972 2.9967 3.7495
quadrupole: 0.3182 -11.6952 11.3770 -6.3972 2.9967 3.7495
hfenergy: -1061.9714163 hartree
pointgroup: C01 [X(C13H12N2O6)]
dipole: 2.696611 0.2584527 -1.3722998 debye
polarizability: 324.8788473|6.0459973|183.0603729|-8.6306826|23.9333804|104.9341295 unknown
InChI: InChI=1S/C13H12N2O6/c1-13(2)7-9(12(16)21-13)5-8-3-4-10(14(17)18)6-11(8)15(19)20/h3-6H,7H2,1-2H3
charge 0 multiplicity 1
33 atoms
O  3.534469 1.343756 1.056843
O  1.309742 1.916468 1.364978
O  -1.943699 -3.369851 -1.047837
O  0.236102 -2.770093 -0.791295
O  -5.10398 1.796488 0.556189
O  -5.489239 -0.435882 0.268779
N  -1.027396 -2.491416 -0.826166
N  -4.71489 0.594769 0.294746
C  4.350043 0.392766 0.18278
C  3.419483 0.171288 -1.047289
C  2.024744 0.415326 -0.50236
C  4.560576 -0.893639 0.998782
C  5.657777 1.118046 -0.139112
C  2.170882 1.288832 0.714709
C  0.892108 -0.173291 -0.994789
C  -0.514491 -0.003318 -0.573343
C  -1.453494 -1.085821 -0.575663
C  -1.034958 1.286514 -0.261134
C  -2.822628 -0.906765 -0.299453
C  -2.393453 1.492796 0.027646
C  -3.272426 0.388165 -0.000276
H  3.542361 -0.834726 -1.481514
H  3.658476 0.915786 -1.832376
H  3.602764 -1.411736 1.183595
H  5.230197 -1.585094 0.455929
H  5.020396 -0.65413 1.972333
H  6.271888 0.504608 -0.823383
H  5.458879 2.090343 -0.621804
H  6.238799 1.29937 0.780877
H  1.045991 -0.883319 -1.816114
H  -0.349772 2.134393 -0.247109
H  -3.510428 -1.755505 -0.30951
H  -2.780725 2.485573 0.269539
