program: Gaussian 09
title: 000264175
version: EM64L-G09RevD.01
frameworkgroup: C1[X(C19H16N2O4)]
method: RPBEPBE
basis: SDD
operation: Freq
keyword: #p
keyword: freq=noraman
keyword: PBEPBE/SDD
title: #p freq=noraman PBEPBE/SDD
converged: YES YES NO NO
title: Mulliken charges:
elementType: O O O O N N C C C C C C C C C C C C C C C C C C C H H H H H H H H H H H H H H H H
charge: -0.204120 -0.229978 -0.215662 -0.259365 -0.006831 -0.445119 -0.306432 -0.318812 -0.152943 0.134860 0.192437 0.301992 0.089532 0.247786 -0.342966 -0.340861 -0.278841 -0.324964 -0.250363 -0.224770 -0.256851 -0.217979 -0.213800 0.205252 -0.802509 0.272788 0.239368 0.245759 0.237245 0.273234 0.296610 0.314413 0.238302 0.240758 0.233291 0.403736 0.241286 0.230974 0.256508 0.251463 0.245572
chargesum: 0.00000
title: Mulliken charges with hydrogens summed into heavy atoms:
elementType: O O O O N N C C C C C C C C C C C C C C C C C C C
charge: -0.204120 -0.229978 -0.215662 -0.259365 -0.006831 -0.041383 -0.033644 0.166315 -0.152943 0.134860 0.192437 0.301992 0.089532 0.247786 -0.105721 -0.067627 0.017769 -0.010551 -0.012061 0.015988 -0.023560 0.023306 0.017174 0.205252 -0.048966
polarizability: 3.93344826e+02 -6.61828144e+00 2.85994284e+02 4.29059904e+00 1.52129506e+01 1.21134664e+02
1716.lowfreq: -0.0004 0.0003 0.0006 1.1665 3.7051 7.4544 17.8215 26.7579 39.7175
frequency: 17.6993 26.7442 39.7031 55.1481 62.0014 70.5308 89.3120 95.5089 104.9341 121.6675 142.0067 145.4417 172.6579 182.5275 203.4658 213.8114 265.0556 285.2437 296.5306 337.7290 348.2922 381.5109 400.0082 416.4624 437.5463 456.9858 487.3867 494.7407 523.7062 540.5029 574.3450 597.7326 613.2233 623.7425 641.4601 646.1842 663.9680 679.8298 696.3457 707.4007 740.0341 759.1923 778.0761 784.5170 809.3704 822.4224 848.7549 856.0569 873.5498 895.6676 936.9776 944.4064 944.5079 956.7353 970.5810 986.5211 990.4324 992.0603 1001.5394 1006.2314 1008.8573 1013.3643 1029.2451 1034.1930 1039.1010 1046.1663 1088.9114 1109.9306 1132.9431 1172.5132 1174.2623 1176.8047 1193.4528 1210.7278 1217.5047 1230.0142 1250.1999 1268.8221 1294.7298 1306.6318 1322.5211 1336.6501 1363.6449 1389.2265 1389.6572 1435.6635 1436.5547 1453.9680 1460.7953 1472.5207 1476.5580 1479.5750 1503.9028 1560.0339 1563.6952 1592.1219 1596.0541 1610.0428 1620.0215 1640.2336 1672.4744 2982.2400 2995.5493 3025.9589 3089.1747 3114.3820 3114.6763 3134.3736 3136.0436 3141.9555 3152.5053 3157.2865 3162.1925 3173.4855 3181.0062 3194.7600 3348.6711
redmass: 5.1650 6.5833 4.2853 7.1614 3.9358 3.4051 3.2574 3.9151 1.7746 3.9268 6.0175 5.6228 4.4987 5.5296 5.1897 5.0745 6.1436 5.2661 7.7449 5.6115 4.9182 6.3069 2.8227 6.0602 4.4871 5.3807 5.8596 3.7230 4.8732 3.7653 7.0018 3.1945 6.4790 8.0329 5.5003 5.5003 7.3888 4.7875 1.6153 6.3393 5.5025 3.1058 1.5320 2.3463 4.5523 4.2134 4.3538 1.2594 1.2291 1.3979 6.3537 1.7353 4.3048 4.4785 1.4251 3.1219 3.1980 1.5131 1.3146 2.8097 1.6685 1.3795 2.0187 3.0018 2.6506 1.6321 1.6082 2.1076 2.8580 1.1762 1.0999 1.0731 1.1424 2.3107 2.1639 2.7909 1.3659 2.1566 2.0604 1.7396 1.3697 1.3578 6.8850 1.5779 3.2840 2.3425 2.2914 2.3532 1.1581 1.0997 1.1853 1.8963 2.4130 7.4356 4.7502 6.4661 5.9695 6.2833 4.6659 10.6958 12.2940 1.0811 1.0362 1.0616 1.0970 1.1016 1.1067 1.0853 1.0872 1.0879 1.0921 1.0935 1.0961 1.1015 1.0963 1.0956 1.0781
irintensity: 0.1636 0.7595 0.7857 3.7820 0.7208 9.7101 0.3266 1.7823 0.2952 3.3739 2.0682 1.7080 6.4315 7.1113 2.6625 7.2486 0.9973 3.7115 4.5645 1.0396 0.4182 7.5702 0.2923 2.7175 3.8271 0.2847 5.7427 11.6629 6.2604 5.3908 13.4839 1.2101 0.2066 6.0392 32.1323 14.1977 5.8796 6.4614 54.0813 8.9596 14.1930 32.9286 51.5943 46.5846 17.9115 16.6138 6.5333 1.2499 56.8846 7.9745 35.3931 29.4770 48.2686 127.1350 12.4410 72.8594 88.9505 8.7876 4.4745 65.6845 8.2372 1.9811 4.3819 5.4621 23.6558 17.2491 15.1202 58.4485 242.5917 1.5535 16.1213 5.1887 47.2556 37.4261 49.2317 77.8268 29.0553 29.6736 180.8780 66.4547 31.9137 9.0968 207.3244 41.6038 18.9600 21.8802 42.8198 32.8232 43.3948 16.7505 6.6209 1.2497 428.9128 91.3839 353.5985 55.5251 24.5594 24.1596 122.2729 80.8279 122.1799 9.1194 6.8854 38.7840 9.1781 8.6849 21.0397 1.7900 7.3175 5.2348 14.4847 23.1953 16.2376 22.7678 13.1393 7.6068 185.8317
temp: 298.150 k
press: 1.00000 atm
elementType: 8 8 8 8 7 7 6 6 6 6 6 6 6 6 6 6 6 6 6 6 6 6 6 6 6 1 1 1 1 1 1 1 1 1 1 1 1 1 1 1 1
symmnumber: 1
zpe: 814867.9 jmol-1
zpe.correction: 0.310367 hartree
zpe.thermalcorrener: 0.332277 hartree
zpe.thermalcorrenthalpy: 0.333221 hartree
zpe.thermalcorrgfe: 0.256996 hartree
zpe.sumelectzpe: -1142.266991 hartree
zpe.sumelectthermal: -1142.245081 hartree
zpe.sumelectthermalent: -1142.244137 hartree
zpe.sumelectthermalfe: -1142.320362 hartree
dipole: 8.1339 0.2522 -1.6286
dipole: 8.2992
quadrupole: -117.4028 -165.0773 -145.4606
quadrupole: 10.3720 -0.9527 6.4993
quadrupole: 25.2441 -22.4304 -2.8137 10.3720 -0.9527 6.4993
hfenergy: -1142.5773581 hartree
pointgroup: C01 [X(C19H16N2O4)]
dipole: 3.2144601 -0.1091619 0.5625792 debye
polarizability: 393.1241793|3.2670807|287.0684655|-12.3614412|-3.489|120.2811285 unknown
InChI: InChI=1S/C19H16N2O4/c1-12(22)20-15-9-5-6-10-16(15)21-17-14(11-25-19(17)24)18(23)13-7-3-2-4-8-13/h2-10,14,20H,11H2,1H3
charge 0 multiplicity 1
41 atoms
O  0.840059 3.538179 -1.327582
O  1.012951 -0.856682 -0.817726
O  -1.386836 3.862529 -0.748002
O  -3.298972 -3.545256 0.275743
N  -1.043264 0.841774 0.21898
N  -1.986474 -1.600535 0.131934
C  1.32351 1.477471 -0.146645
C  1.825335 2.4196 -1.282063
C  -0.185971 1.736903 -0.165853
C  1.786114 0.022613 -0.335127
C  -0.386714 3.122328 -0.741345
C  3.194763 -0.325204 0.044303
C  -2.430722 0.770482 0.333773
C  -2.935316 -0.590066 0.363835
C  4.093056 0.605533 0.637772
C  3.648481 -1.649064 -0.217339
C  -3.338906 1.858428 0.494606
C  -4.31745 -0.824231 0.580521
C  5.409788 0.218447 0.964134
C  4.962135 -2.033829 0.108262
C  -4.70277 1.607901 0.72271
C  5.847568 -1.100286 0.700834
C  -5.183146 0.272765 0.763803
C  -2.176417 -2.984316 0.095879
C  -0.902641 -3.781487 -0.170023
H  1.718491 1.851492 0.819162
H  2.812732 2.866949 -1.096392
H  1.814866 1.916367 -2.265249
H  3.775835 1.629594 0.86103
H  2.949108 -2.353981 -0.678587
H  -2.95736 2.880817 0.441034
H  -4.680901 -1.852951 0.598439
H  6.092426 0.940233 1.424684
H  5.300223 -3.055022 -0.0967
H  -5.393387 2.445874 0.862031
H  -1.035833 -1.228098 -0.035068
H  6.870105 -1.399042 0.956244
H  -6.249067 0.084639 0.935271
H  -0.07357 -3.157501 -0.542998
H  -1.127869 -4.575409 -0.901001
H  -0.584662 -4.277658 0.76532
