program: Gaussian 09
title: 000264105
version: EM64L-G09RevD.01
frameworkgroup: C1[X(C10H13NO2S)]
method: RPBEPBE
basis: SDD
operation: Freq
keyword: #p
keyword: freq=noraman
keyword: PBEPBE/SDD
title: #p freq=noraman PBEPBE/SDD
converged: NO YES NO NO
title: Mulliken charges:
elementType: S O O N C C C C C C C C C C H H H H H H H H H H H H H
charge: 0.242030 -0.282191 -0.343865 -0.606517 -0.500798 -0.447667 0.420597 -0.484560 -0.373495 0.108185 -0.229049 0.212547 -0.216810 -0.676102 0.232818 0.232870 0.224297 0.224322 0.226700 0.226717 0.312000 0.383507 0.224727 0.224991 0.210043 0.227353 0.227348
chargesum: 0.00000
title: Mulliken charges with hydrogens summed into heavy atoms:
elementType: S O O N C C C C C C C C C C
charge: 0.242030 -0.282191 -0.343865 0.088991 -0.035110 0.000952 0.420597 -0.031143 -0.373495 0.108185 -0.229049 0.212547 0.232908 -0.011358
polarizability: 1.82537436e+02 -2.28256446e+00 1.63113279e+02 7.57209681e-02 -3.06937531e-02 7.55995941e+01
1716.lowfreq: -99.2221 -6.8603 -4.6510 0.0017 0.0017 0.0024 8.5416 36.0604 71.5481
frequency: -99.2201 35.9651 71.5450 84.5782 104.7079 136.7005 142.8125 207.6010 212.3724 242.7569 266.0521 291.0197 319.1360 363.6405 374.7180 387.5763 431.8346 497.8058 518.3190 525.2634 602.3001 687.6232 704.8465 720.4026 744.5625 754.6057 754.7509 799.0060 823.7224 877.1279 888.1378 909.8671 1007.1771 1017.6341 1029.5054 1036.8739 1077.1534 1110.9590 1134.6991 1136.5430 1155.7585 1182.4334 1229.1557 1231.7626 1245.7377 1255.0023 1278.1212 1307.7426 1332.5901 1367.8272 1398.1030 1419.6875 1460.4041 1461.1698 1472.2467 1475.3735 1485.9612 1487.2537 1494.4511 1576.7595 1604.3083 1611.0830 2972.1432 2994.0936 2998.5756 3007.7482 3011.6900 3023.3054 3042.7827 3064.5952 3083.6977 3090.5730 3105.6125 3336.8171 3652.3525
redmass: 1.5817 2.9026 2.5946 3.7505 4.0020 3.7599 3.3192 3.8977 4.3706 1.3513 3.7845 4.8785 5.1675 1.2571 8.6544 3.8961 6.0908 8.0962 6.7206 3.6688 6.3014 6.4694 1.7681 5.3648 1.3050 4.9993 1.9280 1.1009 4.6365 4.6991 3.1345 1.3788 3.4980 2.9428 3.4876 1.6976 2.8146 2.2092 1.4513 1.1569 4.0072 1.1952 1.2671 1.0767 1.1367 2.5483 1.5820 1.7919 2.3639 2.0304 1.2899 6.6505 1.1120 1.0411 1.0759 1.0725 1.1130 1.0997 2.4196 9.9859 1.9186 4.9001 1.0582 1.0358 1.0594 1.0581 1.1038 1.0616 1.1032 1.1065 1.1050 1.0985 1.1024 1.0589 1.0912
irintensity: 0.8248 0.2366 1.4939 0.3312 5.6362 5.0209 3.0885 2.6415 3.5939 0.0790 2.5381 0.0027 18.0907 119.5915 5.4174 6.0490 4.8611 2.6682 1.3125 35.5378 10.6681 9.5986 56.8998 2.6171 18.8972 8.4431 65.4939 2.6456 2.8048 27.5130 5.2523 0.2856 2.7835 8.4391 149.6256 0.0050 221.2461 1.5268 5.2853 0.0299 57.6070 0.0147 8.2695 0.0439 0.0310 208.7061 4.4223 19.7323 51.1424 13.8785 24.5278 24.8422 0.4541 12.5159 20.1664 4.3125 0.9929 8.1418 259.6856 424.7194 184.5899 25.8498 70.1493 20.9355 35.9809 25.3293 18.5377 73.0288 4.5527 9.5212 49.4504 35.8493 48.0384 135.8032 91.3533
temp: 298.150 k
press: 1.00000 atm
elementType: 16 8 8 7 6 6 6 6 6 6 6 6 6 6 1 1 1 1 1 1 1 1 1 1 1 1 1
symmnumber: 1
zpe: 561938.7 jmol-1
zpe.correction: 0.214031 hartree
zpe.thermalcorrener: 0.227656 hartree
zpe.thermalcorrenthalpy: 0.228600 hartree
zpe.thermalcorrgfe: 0.173114 hartree
zpe.sumelectzpe: -991.079248 hartree
zpe.sumelectthermal: -991.065624 hartree
zpe.sumelectthermalent: -991.064680 hartree
zpe.sumelectthermalfe: -991.120166 hartree
dipole: 0.1339 0.6934 0.0077
dipole: 0.7062
quadrupole: -81.5503 -79.3823 -91.6914
quadrupole: -4.8591 0.0031 -0.0354
quadrupole: 2.6577 4.8257 -7.4834 -4.8591 0.0031 -0.0354
hfenergy: -991.2932796 hartree
pointgroup: C01 [X(C10H13N1O2S1)]
dipole: 0.0754627 -0.267315 -0.0069944 debye
polarizability: 182.0137592|3.8877225|163.619664|-0.4475691|1.1497109|75.6168858 unknown
InChI: InChI=1S/C10H13NO2S/c1-2-13-10(12)8-6-4-3-5-7(6)14-9(8)11/h2-5,11H2,1H3
charge 0 multiplicity 1
27 atoms
S  2.699025 1.415316 0.005598
O  -2.018796 -0.413865 0.004049
O  -1.956924 1.923857 0.036182
N  0.484534 3.117958 0.038837
C  0.586819 -2.035437 -0.028032
C  2.005059 -2.72621 -0.045035
C  0.904456 -0.555376 -0.010549
C  3.10968 -1.595406 -0.03543
C  2.260837 -0.353595 -0.015029
C  0.1121 0.662943 0.009242
C  0.927012 1.823966 0.019778
C  -1.331836 0.808466 0.018364
C  -3.507967 -0.316164 0.011667
C  -4.041438 -1.745745 -0.015545
H  -0.007649 -2.330714 0.855831
H  -0.017537 -2.30763 -0.912584
H  2.125168 -3.383271 0.83358
H  2.115716 -3.358755 -0.942679
H  3.76161 -1.652962 -0.928903
H  3.770081 -1.676312 0.849974
H  1.116884 3.913122 0.043766
H  -0.542503 3.226193 0.045431
H  -3.820155 0.233946 0.91808
H  -3.827147 0.270691 -0.86886
H  -5.146879 -1.732961 -0.010037
H  -3.704057 -2.274621 -0.923417
H  -3.695593 -2.312034 0.866221
