program: Gaussian 09
title: 000264102
version: EM64L-G09RevD.01
frameworkgroup: C1[X(C10H11BrO2S)]
method: RPBEPBE
basis: SDD
operation: Freq
keyword: #p
keyword: freq=noraman
keyword: PBEPBE/SDD
title: #p freq=noraman PBEPBE/SDD
converged: YES YES NO NO
title: Mulliken charges:
elementType: Br S O O C C C C C C C C C C H H H H H H H H H H H
charge: -0.039879 0.952475 -0.563254 -0.556420 -0.590173 -0.350580 -0.846601 -0.688208 0.447576 0.507509 -0.383416 -0.409058 -0.228468 -0.229434 0.284508 0.294870 0.279683 0.249793 0.298298 0.299073 0.312781 0.242301 0.235521 0.240926 0.240178
chargesum: 0.00000
title: Mulliken charges with hydrogens summed into heavy atoms:
elementType: Br S O O C C C C C C C C C C
charge: -0.039879 0.952475 -0.563254 -0.556420 -0.010796 0.178896 -0.249230 -0.375427 0.447576 0.507509 -0.141115 -0.173536 0.012458 0.010744
polarizability: 1.85913757e+02 1.77210944e+01 1.63399979e+02 -1.18579397e+01 6.25819407e+00 1.21752977e+02
1716.lowfreq: -13.4943 -0.0015 -0.0008 0.0006 7.5278 10.1448 57.4664 66.2954 89.0180
frequency: 57.4513 66.2615 89.0024 121.2513 154.7475 167.5466 207.8607 232.0776 246.0981 278.8831 288.0608 331.4982 348.1519 369.3703 409.9586 438.4197 499.7813 545.0193 570.5124 581.5571 599.4352 662.6782 709.9440 759.0834 769.9278 788.8037 830.9942 855.8815 877.1185 903.8230 916.4334 929.6982 959.1494 976.6011 997.4811 1047.9891 1085.6731 1097.3083 1117.8599 1142.6979 1176.8524 1183.1702 1200.1223 1206.5059 1229.0789 1235.6224 1281.3779 1304.7198 1336.5913 1365.5315 1390.8102 1412.3255 1428.4876 1429.2380 1442.8576 1486.8687 1584.2469 1604.2774 2975.8861 3035.5288 3046.1079 3052.1427 3078.4047 3124.6694 3135.4596 3137.2622 3139.2475 3151.0158 3171.3719
redmass: 8.3565 6.4471 6.7061 9.3224 6.5759 6.2797 3.9280 3.4247 6.3558 2.5666 5.1390 5.1626 4.3426 3.5110 3.7439 4.4062 4.3940 3.0762 5.4553 4.4666 4.9567 3.2658 4.1339 3.3889 1.3370 9.4689 3.8775 2.1282 1.4594 2.2414 2.9796 3.8758 1.4440 1.9745 1.3570 2.5104 1.4403 2.4745 1.2739 1.2158 1.1791 1.0889 1.7833 1.1602 1.6404 1.6891 1.5199 1.2259 1.5162 1.6555 3.0947 1.1127 1.2865 1.1271 1.7272 2.4892 6.4202 6.1308 1.0608 1.0954 1.0584 1.0610 1.0868 1.0883 1.0966 1.1009 1.1084 1.0934 1.1009
irintensity: 5.5680 1.5885 1.4777 2.9935 2.9856 7.4810 1.9149 4.4712 0.3541 2.2989 16.4765 25.6981 6.3741 4.8867 12.5710 18.0152 13.1147 7.8727 27.9156 9.5432 13.2140 35.2226 9.9827 4.9114 50.7299 69.4344 0.5620 9.7629 18.4497 37.1560 56.1723 34.4619 2.2315 10.0178 0.0381 0.3170 3.7491 2.0031 5.6349 1.2494 21.7632 7.2656 16.6756 1.5638 19.5636 2.0128 4.5652 3.9172 12.7081 0.5953 3.8919 10.8844 1.1423 20.0840 19.9462 9.4423 0.4833 4.1604 8.6360 4.3635 5.4995 5.5863 5.3290 7.2699 1.4933 0.6420 0.7403 15.4344 22.8736
temp: 298.150 k
press: 1.00000 atm
elementType: 35 16 8 8 6 6 6 6 6 6 6 6 6 6 1 1 1 1 1 1 1 1 1 1 1
symmnumber: 1
zpe: 492729.1 jmol-1
zpe.correction: 0.187671 hartree
zpe.thermalcorrener: 0.201118 hartree
zpe.thermalcorrenthalpy: 0.202062 hartree
zpe.thermalcorrgfe: 0.146856 hartree
zpe.sumelectzpe: -948.443103 hartree
zpe.sumelectthermal: -948.429656 hartree
zpe.sumelectthermalent: -948.428712 hartree
zpe.sumelectthermalfe: -948.483918 hartree
dipole: -4.7830 2.2239 1.2235
dipole: 5.4147
quadrupole: -104.5706 -109.1330 -95.4546
quadrupole: 17.6924 1.2635 10.6289
quadrupole: -1.5179 -6.0803 7.5982 17.6924 1.2635 10.6289
hfenergy: -948.6307737 hartree
pointgroup: C01 [X(C10H11Br1O2S1)]
dipole: 1.7068761 1.2637824 -0.1664383 debye
dipolederiv: -0.2453675 0.164897 0.0812402 0.1226938 -0.4818075 -0.2122509 0.1370435 -0.4299639 -0.4886185 1.3062289 0.1483671 0.0104092 0.1020249 1.1624496 0.0570041 0.1919761 0.0566837 1.0927421 -0.5325284 0.0125262 0.04164 -0.0507406 -0.5761358 -0.0466706 -0.145118 -0.1268073 -0.6344163 -0.8553365 -0.1677418 0.0319024 -0.1046732 -0.5812596 0.0208025 0.0916505 0.103715 -0.5305059 -0.1167408 -0.0245746 -0.0054152 -0.0135209 0.0125757 -0.015873 -0.0850497 -0.0866881 -0.0517122 -0.0102011 0.1745162 0.0862542 0.020964 -0.1869647 -0.0535956 0.0217846 -0.1159169 -0.1196424 0.134222 0.0209891 -0.0357074 -0.0055839 -0.0738773 -0.053601 -0.0076614 -0.0431092 -0.0840961 0.3140106 -0.3579357 -0.1546823 -0.26486 0.694545 0.3828101 -0.1376818 0.6008471 0.7233703 0.0394736 0.0535372 0.0156545 -0.0355311 0.0400168 0.0513857 -0.1573085 -0.0187583 -0.0903954 -0.0884967 0.0914332 0.0037615 0.0716518 -0.1216188 -0.0364566 0.0042896 -0.0238919 -0.1398522 -0.2196686 0.1011375 -0.0353655 0.0008226 0.0617006 -0.0822769 0.0260256 -0.0760934 -0.0582603 -0.1270209 -0.0394221 -0.0253677 0.1490361 0.0058629 -0.1215774 -0.0173814 -0.0765997 -0.0813567 0.0959821 -0.1241068 -0.0141995 -0.0725063 0.0239827 -0.0361128 -0.0210146 -0.0022457 -0.0981728 0.0732748 0.0267865 -0.1037704 -0.0518434 -0.094952 -0.0235828 -0.0729406 -0.0007254 -0.0630103 0.1121829 0.0192344 0.022926 0.0283608 -0.0112539 -0.0140948 0.057736 0.0252578 -0.0047242 -0.0091125 -0.0093669 -0.0549539 0.0029785 0.0442392 0.007557 -0.0651371 0.0069832 0.0552582 0.0370642 -0.0535647 -0.0282623 0.0182648 0.11951 -0.0908241 0.0357574 -0.0656016 0.0032287 0.0167882 -0.0154018 -0.0152435 0.0550238 -0.0995975 0.0891787 -0.0259221 0.0702599 0.088682 0.0346687 0.0227652 -0.0270557 -0.0381026 -0.0077571 0.0590054 -0.0215092 0.0276103 0.0609654 -0.0488527 0.0046391 0.0069689 0.0550153 0.0952101 -0.049147 -0.007879 -0.0358796 0.0390022 0.0032146 -0.0797493 0.048467 -0.0142717 -0.0128577 -0.0280769 0.0342914 0.0055399 -0.0573039 0.0794264 -0.058732 0.0525475 -0.0242945 -0.0317275 0.0637947 0.0249736 0.0814646 0.0871954 0.0908289 0.0006258 0.0025769 -0.0420331 -0.0678744 0.0817146 0.0352761 0.0736156 0.09528 -0.007689 0.0966021 0.0110212 0.1163606 -0.0024787 0.0200592 0.0172117 0.0197981 0.1402218 -0.0763512 -0.0074608 0.0846537 -0.0252357 0.0900698 0.0308283 0.0865876 0.0305057 0.1161212 unknown
polarizability: 190.07363|-9.1969084|159.6300943|-16.3609685|3.9771721|121.3629889 unknown
InChI: InChI=1S/C10H11BrO2S/c11-10-5-6-14(12,13)7-8-3-1-2-4-9(8)10/h1-4,10H,5-7H2
charge 0 multiplicity 1
25 atoms
Br -0.487074 2.756044 1.542777
S  -2.115268 -1.002808 -0.10851
O  -1.535832 -1.619533 -1.510541
O  -3.406903 -1.662323 0.650536
C  -2.496099 0.862477 -0.424568
C  -1.309586 1.57073 -1.078211
C  -0.64636 -0.85119 1.218088
C  -0.013615 1.821457 -0.267924
C  0.663891 -0.566763 0.566442
C  0.968057 0.687006 -0.056256
C  1.655123 -1.579883 0.595999
C  2.273767 0.888355 -0.573086
C  2.942535 -1.370256 0.058264
C  3.257044 -0.123282 -0.522607
H  -2.777842 1.257223 0.563814
H  -3.371485 0.823713 -1.092787
H  -1.018553 1.007299 -1.989226
H  -1.684064 2.557442 -1.412594
H  -0.701338 -1.828409 1.720792
H  -1.03251 -0.049651 1.867343
H  0.521194 2.646387 -0.76331
H  1.410658 -2.544426 1.054967
H  2.521307 1.853033 -1.032195
H  3.689828 -2.169492 0.096408
H  4.253527 0.061347 -0.937011
