program: Gaussian 09
title: 000256145
version: EM64L-G09RevD.01
frameworkgroup: C1[X(C25H19Cl)]
method: RPBEPBE
basis: SDD
operation: Freq
keyword: #p
keyword: freq=noraman
keyword: PBEPBE/SDD
title: #p freq=noraman PBEPBE/SDD
converged: YES YES NO NO
title: Mulliken charges:
elementType: Cl C C C C C C C C C C C C C C C C C C C C C C C C C H H H H H H H H H H H H H H H H H H H
charge: -0.084040 -0.619585 0.189838 0.378320 0.317556 -0.762934 0.297330 0.168768 0.695832 -0.434850 0.421515 -0.416227 -0.405518 -0.497881 -0.504207 -0.373231 -0.425774 -0.248773 -0.248663 -0.443735 0.481267 -0.278320 -0.225248 -0.248980 -0.445485 -0.821204 0.266260 0.242481 0.232634 0.236101 0.256655 0.234870 0.236890 0.240164 0.254158 0.226632 0.226607 0.238829 0.228081 0.253631 0.227944 0.238020 0.234216 0.235391 0.224666
chargesum: 0.00000
title: Mulliken charges with hydrogens summed into heavy atoms:
elementType: Cl C C C C C C C C C C C C C C C C C C C C C C C C C
charge: -0.084040 -0.353325 0.189838 0.378320 0.317556 -0.287819 0.297330 0.168768 0.695832 -0.198749 0.421515 -0.159572 -0.170648 -0.260992 -0.264042 -0.119073 -0.425774 -0.022142 -0.022056 -0.204906 0.481267 -0.050239 0.028383 -0.021036 -0.207465 -0.126932
polarizability: 3.04987497e+02 2.05729365e+01 2.78202885e+02 4.20743650e+00 -4.21137937e+01 2.34518613e+02
1716.lowfreq: -6.9711 -0.0004 0.0005 0.0019 2.0391 7.9018 16.2435 28.4688 32.0351
frequency: 16.0070 28.3808 32.0155 49.1319 57.1011 81.2367 106.1895 127.3803 131.2338 153.7913 171.9691 204.6502 215.6678 242.5654 275.6285 299.5525 315.9795 321.8338 333.6696 355.1000 417.1978 419.9749 434.0783 444.5131 447.8979 485.9279 498.8269 506.4868 523.3959 538.4773 550.6280 590.1812 600.8851 614.5363 626.4235 655.9089 662.7830 710.4314 718.8864 721.5203 740.3032 756.8036 767.2150 774.8050 794.1398 801.8886 813.0274 826.2602 857.9378 872.0434 875.9785 884.4022 903.4249 921.1065 938.6145 951.4278 954.6974 957.8674 965.3459 978.4641 988.1872 993.0097 1001.9143 1014.5079 1034.6106 1041.1918 1050.6701 1066.5081 1106.3107 1138.6467 1152.1745 1156.4534 1171.6657 1174.9009 1181.8230 1184.4631 1206.4848 1210.4756 1216.1643 1225.2063 1234.6582 1248.5303 1253.5786 1277.4701 1290.4709 1312.6888 1324.1454 1368.9478 1371.6090 1388.9274 1395.3821 1400.8064 1407.1696 1424.4676 1428.8793 1441.7106 1448.2135 1459.9663 1471.0232 1471.3382 1476.5688 1491.1912 1518.3677 1580.5006 1585.5165 1598.6038 1603.9612 1608.9050 1614.9805 1634.5216 2927.8802 2979.1038 3006.7661 3017.4213 3058.1197 3086.9876 3113.4316 3113.8108 3119.4264 3127.1843 3132.9493 3133.4985 3136.4100 3139.8178 3140.9052 3152.6451 3160.5332 3166.7855 3168.4958
redmass: 1.0538 4.7449 5.0773 5.3485 4.6848 3.9662 5.1089 5.6652 4.2242 3.9028 5.7124 3.7450 4.5080 3.1534 4.4452 4.9255 3.6089 4.8076 5.0486 8.8847 3.7738 3.3593 2.9881 4.4082 3.0753 3.9716 4.6183 3.8094 6.1207 3.5905 4.9042 5.0835 5.0440 4.8473 5.1309 5.2086 4.9334 4.2464 4.3055 4.4655 1.7109 1.3190 2.5986 4.1458 3.6702 2.8492 1.3029 1.3692 3.6643 1.5760 2.3526 1.8863 1.8107 2.5490 2.2418 1.6948 1.8010 1.5700 1.6465 1.4608 1.3178 1.3452 2.7803 2.3571 2.2613 2.3053 1.5637 3.1604 2.2005 1.8242 1.4249 1.4455 1.3957 1.0686 1.6448 1.1838 1.4606 1.8552 2.1634 1.5158 1.9221 1.5589 2.5791 1.6748 1.3339 1.8911 2.1682 3.0389 3.2518 5.9885 2.0631 1.4910 3.5206 3.4880 3.1090 2.2565 1.1932 2.6892 2.0670 1.1436 1.1250 2.4485 3.6172 7.2643 6.4321 6.7997 6.4767 6.1110 6.2926 6.8704 1.0687 1.0374 1.0892 1.0822 1.0976 1.0988 1.0870 1.0864 1.0865 1.0878 1.0903 1.0894 1.0896 1.0975 1.0939 1.0947 1.1007 1.0984 1.0961
irintensity: 0.4199 0.0526 0.6235 0.0143 0.1399 0.1002 0.1695 0.3744 0.7907 1.2094 1.2212 1.2502 3.2550 2.6769 0.6396 0.3235 1.7904 0.1482 1.4746 8.0164 2.4661 4.4536 8.0928 3.4446 6.7538 0.8354 4.8777 0.7382 2.0965 10.8278 7.2135 3.5711 8.6309 4.9448 4.1945 0.4857 0.7734 4.1940 1.4247 4.6246 8.9188 73.4696 31.2931 3.9214 8.9244 4.9271 35.1574 50.4925 1.4320 1.4372 4.4129 5.9217 2.0902 2.5923 3.1138 0.5634 0.1263 0.2203 11.8657 0.2872 0.0700 0.1014 15.2943 36.1478 8.9360 5.5726 12.1078 1.8570 7.3523 2.8733 5.0151 1.7320 4.6078 0.5214 2.6258 3.4745 1.9818 2.1252 1.2672 0.6378 3.6842 0.8008 3.1079 3.8180 2.8214 1.1955 3.3469 9.6954 1.8773 0.1899 0.9628 14.9466 3.9351 7.4070 0.1904 4.3549 12.8733 55.5539 9.5009 8.4446 16.9830 26.9344 13.5657 3.7628 2.4091 6.1699 5.7677 2.4504 0.5277 4.5284 20.4098 30.4061 20.3446 5.3290 16.5780 19.7365 3.7926 10.0400 2.5663 3.8046 8.6792 9.1622 11.1370 32.5894 22.4763 31.4514 39.4168 17.3305 8.1630
temp: 298.150 k
press: 1.00000 atm
elementType: 17 6 6 6 6 6 6 6 6 6 6 6 6 6 6 6 6 6 6 6 6 6 6 6 6 6 1 1 1 1 1 1 1 1 1 1 1 1 1 1 1 1 1 1 1
symmnumber: 1
zpe: 935207.2 jmol-1
zpe.correction: 0.356202 hartree
zpe.thermalcorrener: 0.377285 hartree
zpe.thermalcorrenthalpy: 0.378229 hartree
zpe.thermalcorrgfe: 0.304440 hartree
zpe.sumelectzpe: -1422.392292 hartree
zpe.sumelectthermal: -1422.371209 hartree
zpe.sumelectthermalent: -1422.370265 hartree
zpe.sumelectthermalfe: -1422.444054 hartree
dipole: -0.0689 -0.2587 2.7603
dipole: 2.7732
quadrupole: -148.4377 -146.1249 -152.1082
quadrupole: 0.3363 -0.5064 -4.0430
quadrupole: 0.4525 2.7654 -3.2179 0.3363 -0.5064 -4.0430
hfenergy: -1422.7484939 hartree
pointgroup: C01 [X(C25H19Cl1)]
dipole: -0.1319614 -0.07628 -1.0803774 debye
polarizability: 308.0327227|-22.1150262|260.6196853|-3.1512065|-44.7675498|249.0565872 unknown
InChI: InChI=1S/C25H19Cl/c1-16-10-13-23(26)22(14-16)25-21-9-5-3-7-18(21)15-19-12-11-17-6-2-4-8-20(17)24(19)25/h2-14,25H,15H2,1H3
charge 0 multiplicity 1
45 atoms
Cl -0.63646 -2.299009 2.820377
C  -0.418511 0.158717 0.744838
C  0.70274 0.866619 -0.02277
C  -1.728604 0.961482 0.784813
C  0.407046 1.854933 -0.974985
C  -1.02295 2.267676 -1.288305
C  -2.019269 1.94997 -0.188022
C  2.083278 0.499117 0.224637
C  -0.688566 -1.254386 0.179762
C  1.465987 2.499928 -1.6967
C  3.140708 1.160032 -0.515641
C  -2.675013 0.694989 1.807468
C  -3.250964 2.648756 -0.124932
C  2.797285 2.164499 -1.478811
C  -0.841325 -1.446384 -1.21741
C  2.462961 -0.504754 1.179579
C  -0.83694 -2.405005 0.989328
C  -3.901523 1.388377 1.860619
C  -4.194216 2.371464 0.885628
C  4.508357 0.80608 -0.274508
C  -1.135802 -2.704251 -1.794903
C  3.805133 -0.830802 1.394882
C  -1.124879 -3.67638 0.461393
C  4.841353 -0.172253 0.663839
C  -1.277524 -3.821087 -0.934312
C  -1.295093 -2.847025 -3.29868
H  -0.096675 0.028053 1.79409
H  -1.345992 1.770608 -2.230015
H  -1.049734 3.351693 -1.512019
H  1.206504 3.273699 -2.429575
H  -2.445566 -0.064774 2.563065
H  -3.466388 3.42093 -0.8743
H  3.598644 2.6657 -2.034542
H  -0.707619 -0.577974 -1.872842
H  1.69694 -1.031628 1.755369
H  -4.621056 1.169016 2.657155
H  -5.141994 2.92017 0.92029
H  5.292377 1.32118 -0.842784
H  4.065599 -1.599527 2.130795
H  -1.2251 -4.5377 1.127981
H  5.889167 -0.437288 0.842603
H  -1.502658 -4.809443 -1.350811
H  -2.154912 -2.257025 -3.668319
H  -0.397755 -2.485192 -3.834069
H  -1.46049 -3.8983 -3.589654
