program: Gaussian 09
title: 000264085
version: EM64L-G09RevD.01
frameworkgroup: C1[X(C12H17OP)]
method: RPBEPBE
basis: SDD
operation: Freq
keyword: #p
keyword: freq=noraman
keyword: PBEPBE/SDD
title: #p freq=noraman PBEPBE/SDD
converged: NO YES NO NO
title: Mulliken charges:
elementType: P O C C C C C C C C C C C C H H H H H H H H H H H H H H H H H
charge: 0.608714 -0.481784 0.189126 -0.460868 -0.461229 -0.755222 -0.755210 0.419767 -0.931895 -0.389018 -0.411016 -0.260767 -0.218558 -0.243657 0.220957 0.247038 0.247116 0.220725 0.219777 0.262610 0.262653 0.219563 0.248414 0.248533 0.235065 0.330788 0.224554 0.291685 0.223048 0.223057 0.226034
chargesum: 0.00000
title: Mulliken charges with hydrogens summed into heavy atoms:
elementType: P O C C C C C C C C C C C C
charge: 0.608714 -0.150996 0.189126 0.007128 0.006612 -0.272836 -0.272993 0.419767 -0.199883 -0.164464 -0.119331 -0.037719 0.004499 -0.017623
polarizability: 2.08515426e+02 1.56461035e+00 1.35497075e+02 -6.68036450e-02 -3.98686063e-03 1.07856722e+02
1716.lowfreq: -7.8855 -7.3762 -0.0018 -0.0014 -0.0013 20.8778 47.5287 54.1354 92.8482
frequency: 47.1603 54.1252 92.7433 146.4116 163.4112 180.6695 197.2117 214.0422 240.7727 252.3505 265.9933 320.6138 336.9544 382.2962 406.6049 419.0059 451.6990 454.4058 535.2626 601.5932 617.4480 631.0179 640.8167 664.5960 688.8615 709.1577 756.2200 774.9079 852.9339 858.5815 877.1105 890.0810 917.7683 921.0659 927.2532 934.0169 981.0061 990.1289 992.8601 1003.8398 1028.7729 1034.5947 1045.3524 1082.9883 1096.5256 1116.0305 1146.3125 1160.3357 1171.8230 1191.7944 1214.0607 1220.3317 1273.0249 1285.7342 1299.5465 1317.5378 1320.9390 1322.8335 1362.5798 1381.9921 1433.8365 1438.7759 1446.4427 1446.5349 1449.8815 1450.0375 1460.6549 1482.7930 1591.4642 1614.0019 2956.7636 2957.8204 2981.3325 2989.6277 2993.6970 3049.4365 3051.2946 3053.0294 3056.4429 3090.2878 3105.2671 3114.4084 3125.1622 3139.0579 3158.1229 3182.0553 3572.0926
redmass: 4.1648 3.9342 3.5220 1.2306 3.5478 2.0735 1.2592 6.6205 1.6621 3.3641 3.6432 2.1149 3.6385 3.0879 2.8789 2.6378 3.4666 4.4241 3.1382 4.3420 6.4085 3.2544 3.3642 6.1326 3.7941 1.7642 1.6501 1.7016 2.7874 1.2459 1.7727 1.3708 1.7227 1.4321 1.4317 2.3612 1.3653 6.2416 1.9433 1.4785 2.1863 1.8729 2.2880 1.5171 1.2952 2.0694 1.6263 1.3574 1.0606 1.1387 1.5903 1.4809 1.2412 1.4357 1.4217 1.3071 1.3912 1.1848 1.6181 8.6392 2.2327 1.0809 1.0798 1.0933 1.0563 1.0622 1.0736 2.2653 6.2370 6.1184 1.0650 1.0655 1.0328 1.0598 1.0604 1.0964 1.0950 1.1008 1.1023 1.1002 1.1002 1.0859 1.0873 1.0936 1.0993 1.0947 1.0652
irintensity: 0.3987 0.4569 0.4679 0.2372 1.5515 22.1518 74.9835 0.2629 13.9034 1.3664 1.3821 1.6503 4.6545 0.0014 0.0542 0.2053 2.6064 5.1364 10.4106 0.1108 0.0542 7.5722 10.5601 10.0500 2.1885 54.2885 25.9809 24.0354 27.3170 0.3407 1.9835 15.8588 46.6821 11.9413 0.7402 36.5522 0.4626 0.1778 4.0086 0.0226 6.3560 7.2248 2.3604 10.7993 0.9948 7.5545 57.0038 11.5719 0.5991 2.3735 2.3874 2.3680 1.6337 5.1271 7.3831 6.2508 2.7659 15.6311 19.2069 1.4243 14.8042 6.9462 0.3713 11.3264 12.3490 15.8498 23.7209 23.7061 0.4956 8.2031 59.1562 16.6216 34.9172 15.2177 27.1366 35.6577 2.1723 0.9395 32.1275 25.1663 11.7514 12.4917 3.1934 39.1253 30.7257 5.7990 0.9668
temp: 298.150 k
press: 1.00000 atm
elementType: 15 8 6 6 6 6 6 6 6 6 6 6 6 6 1 1 1 1 1 1 1 1 1 1 1 1 1 1 1 1 1
symmnumber: 1
zpe: 681012.7 jmol-1
zpe.correction: 0.259384 hartree
zpe.thermalcorrener: 0.273591 hartree
zpe.thermalcorrenthalpy: 0.274536 hartree
zpe.thermalcorrgfe: 0.218851 hartree
zpe.sumelectzpe: -882.866842 hartree
zpe.sumelectthermal: -882.852634 hartree
zpe.sumelectthermalent: -882.851690 hartree
zpe.sumelectthermalfe: -882.907375 hartree
dipole: 1.6520 0.1139 -0.0005
dipole: 1.6559
quadrupole: -85.1788 -92.8870 -93.2448
quadrupole: 6.5397 -0.0592 0.0340
quadrupole: 5.2580 -2.4501 -2.8079 6.5397 -0.0592 0.0340
hfenergy: -883.1262257 hartree
pointgroup: C01 [X(C12H17O1P1)]
dipole: -0.6508379 -0.028626 -0.0050233 debye
polarizability: 208.5420048|-0.2552755|135.4632492|0.7833287|0.1797969|107.8639682 unknown
InChI: InChI=1S/C12H17OP/c1-14-9-7-12(13,8-10-14)11-5-3-2-4-6-11/h2-6,13H,7-10H2,1H3
charge 0 multiplicity 1
31 atoms
P  -3.352378 0.944745 -0.0184
O  -0.442038 -1.848291 -0.034462
C  -0.274718 -0.373687 -0.014267
C  -0.921326 0.197363 1.288526
C  -0.903542 0.230859 -1.310767
C  -2.452956 -0.000928 1.385346
C  -2.433681 0.034868 -1.433098
C  1.239232 -0.120076 -0.000131
C  -4.996036 -0.022265 -0.041746
C  1.735832 1.209307 0.015431
C  2.162988 -1.19352 -0.000907
C  3.124864 1.460924 0.029464
C  3.554016 -0.941625 0.013244
C  4.042049 0.384357 0.028421
H  -0.689885 1.277489 1.359936
H  -0.426532 -0.296163 2.145931
H  -0.397167 -0.240845 -2.173695
H  -0.671263 1.312335 -1.351558
H  -2.724781 -1.077182 1.346443
H  -2.817858 0.38605 2.353875
H  -2.785704 0.445698 -2.396549
H  -2.704756 -1.042191 -1.424731
H  -5.575522 0.259836 -0.937557
H  -5.5908 0.24193 0.849484
H  -4.826045 -1.11476 -0.051239
H  -1.410551 -2.052059 -0.0455
H  1.041116 2.058546 0.016676
H  1.77591 -2.215148 -0.012763
H  3.490282 2.494098 0.041142
H  4.256509 -1.783154 0.01241
H  5.120641 0.57789 0.039241
