program: Gaussian 09
title: 000256130
version: EM64L-G09RevD.01
frameworkgroup: C1[X(C17H17N3O2)]
method: RPBEPBE
basis: SDD
operation: Freq
keyword: #p
keyword: freq=noraman
keyword: PBEPBE/SDD
title: #p freq=noraman PBEPBE/SDD
converged: YES YES NO NO
title: Mulliken charges:
elementType: O O N N N C C C C C C C C C C C C C C C C C H H H H H H H H H H H H H H H H H
charge: -0.249954 -0.258208 -0.437321 -0.071967 -0.437249 0.468514 0.486384 0.240641 0.484512 -0.366327 -0.387476 -0.457366 -0.339978 -0.349882 -0.433617 -0.333412 -0.355278 -0.392667 0.212519 0.210299 -0.799586 -0.800111 0.229015 0.275649 0.218471 0.308607 0.306566 0.218118 0.237426 0.254050 0.212473 0.309964 0.308588 0.237690 0.270845 0.237584 0.236975 0.269144 0.236364
chargesum: 0.00000
title: Mulliken charges with hydrogens summed into heavy atoms:
elementType: O O N N N C C C C C C C C C C C C C C C C C
charge: -0.249954 -0.258208 -0.127358 -0.071967 -0.128662 0.468514 0.486384 0.240641 0.484512 -0.137312 -0.111827 -0.238895 -0.031371 -0.043316 -0.215499 -0.095986 -0.101228 -0.180193 0.212519 0.210299 -0.053468 -0.057628
polarizability: 5.69732007e+02 1.02603630e+01 1.99372306e+02 -1.84780154e-01 -8.73783059e-01 1.01638633e+02
1716.lowfreq: -87.5240 -80.8505 -4.0460 -1.8699 -0.0010 0.0007 0.0011 7.1845 17.7043
frequency: -87.5207 -80.8461 17.6905 27.7151 35.4008 56.7139 68.5154 74.5466 84.4687 106.0433 128.4241 164.0590 175.6558 206.5522 222.0348 254.5611 311.1488 323.4782 343.0826 353.9914 388.7021 409.3510 413.7368 418.9988 480.4822 493.4423 522.6404 546.4368 551.3868 581.3849 582.6806 616.5291 628.8306 640.3159 642.5719 648.5024 663.4779 730.3527 745.1745 787.5973 816.4018 823.1156 826.0157 837.3932 843.5810 868.9840 883.1905 929.0469 929.3796 943.6308 952.2002 978.0122 983.6608 984.0953 985.3038 1001.1447 1004.8374 1016.1022 1029.6556 1030.6231 1118.6008 1120.8770 1163.5888 1182.2726 1197.6981 1216.3509 1219.0042 1248.5946 1263.2738 1271.2121 1299.3536 1306.8408 1346.9343 1359.8048 1375.5676 1376.5430 1386.5521 1419.9287 1423.0255 1448.0334 1448.4870 1467.8250 1467.8311 1489.5591 1495.0268 1501.9744 1512.3014 1567.7771 1579.1728 1591.9256 1622.6743 1626.8183 1632.2320 1638.3167 2940.6990 2986.5841 2987.1860 3071.3696 3071.9707 3107.9506 3111.1856 3134.1518 3134.8387 3135.8561 3137.0330 3158.0130 3165.1803 3192.8826 3196.9046 3517.1578 3519.8644
redmass: 1.0475 1.0466 6.2629 4.6753 4.6169 4.3173 5.4086 4.8232 4.7625 5.6894 4.4799 5.0722 4.5690 5.6022 3.2119 6.4990 4.1769 6.4650 4.0696 3.7969 4.6559 3.9831 3.1291 3.3997 4.7549 4.6087 2.5936 2.8203 3.7515 2.9673 2.8638 5.8589 6.9914 1.2027 5.5545 1.1870 5.9349 3.5952 3.6952 4.8666 4.1247 1.4250 1.3505 5.4589 2.1423 2.6953 1.4156 6.4914 6.4897 1.3827 1.3746 1.6267 1.4005 1.6733 1.6126 2.4167 2.5690 1.3302 1.6564 1.6606 1.3442 1.3596 1.9065 1.1303 1.5441 3.3203 3.3377 1.7823 1.8641 2.2700 1.4016 1.4805 3.8757 4.1436 1.2434 1.2366 1.9396 3.8070 4.1833 1.1538 1.1624 1.0471 1.0471 2.0572 2.0325 2.5226 3.0989 5.6319 4.9069 5.2997 5.7947 6.0195 5.4290 5.3613 1.0855 1.0384 1.0385 1.0984 1.0983 1.0872 1.0897 1.0962 1.0902 1.0978 1.0978 1.0907 1.0948 1.0945 1.0950 1.0763 1.0764
irintensity: 0.0050 0.0117 0.5133 4.4033 11.6419 0.3382 1.0859 8.7532 0.9777 0.3716 4.7768 16.9088 0.5470 1.6579 11.7493 1.1283 7.0401 4.7966 1.0955 6.5968 0.1376 4.1243 5.9414 1.7833 4.6457 8.9685 8.3202 43.8917 14.8778 0.2423 4.7048 10.2401 0.0384 60.3967 16.2185 59.7747 2.7607 2.4563 2.4400 0.5718 2.7925 9.2712 48.7251 1.0534 61.0911 29.1442 54.8043 0.2767 16.8694 7.3803 0.7094 36.3062 7.0859 50.0755 21.0181 8.9667 5.8470 0.5903 7.8962 8.2428 27.6826 5.5441 17.8253 93.6633 11.8576 121.8304 57.7204 35.3941 9.6527 93.6092 47.8888 7.1702 559.0679 12.6323 67.6099 54.2780 158.8761 50.0196 81.8595 34.2166 80.9131 8.4693 31.6356 65.5333 608.4936 63.6713 395.3094 240.9619 42.3011 35.2249 170.5249 29.1674 150.3369 99.4436 62.7871 11.2607 9.4767 15.7988 15.1062 27.8889 34.0864 16.8987 11.3239 8.6780 8.1354 1.2786 6.5290 4.0057 2.8412 14.8068 13.5790
temp: 298.150 k
press: 1.00000 atm
elementType: 8 8 7 7 7 6 6 6 6 6 6 6 6 6 6 6 6 6 6 6 6 6 1 1 1 1 1 1 1 1 1 1 1 1 1 1 1 1 1
symmnumber: 1
zpe: 801903.9 jmol-1
zpe.correction: 0.305429 hartree
zpe.thermalcorrener: 0.324809 hartree
zpe.thermalcorrenthalpy: 0.325753 hartree
zpe.thermalcorrgfe: 0.254864 hartree
zpe.sumelectzpe: -971.180793 hartree
zpe.sumelectthermal: -971.161413 hartree
zpe.sumelectthermalent: -971.160469 hartree
zpe.sumelectthermalfe: -971.231358 hartree
dipole: 0.8964 1.3041 2.1393
dipole: 2.6610
quadrupole: -79.7829 -125.0941 -134.1213
quadrupole: 50.6433 -2.2317 -0.3454
quadrupole: 33.2165 -12.0947 -21.1219 50.6433 -2.2317 -0.3454
hfenergy: -971.4862216 hartree
pointgroup: C01 [X(C17H17N3O2)]
dipole: 0.3632471 -0.8536493 -0.4851571 debye
polarizability: 569.88388|-4.0850778|175.2996298|5.8576811|-41.9622694|125.5594364 unknown
InChI: InChI=1S/C17H17N3O2/c1-12(21)19-16-5-3-14(4-6-16)11-18-15-7-9-17(10-8-15)20-13(2)22/h3-11,19-20H,1-2H3
charge 0 multiplicity 1
39 atoms
O  6.650431 1.718177 -0.417187
O  -6.732288 -1.231738 1.189661
N  6.095391 -0.4913 0.163587
N  -0.386972 0.327198 -0.377105
N  -6.079564 0.331123 -0.439041
C  1.829903 -0.610139 -0.001938
C  4.676177 -0.481157 0.094762
C  -1.802544 0.255772 -0.343946
C  -4.659056 0.270276 -0.36822
C  2.59661 -1.757855 0.341625
C  2.519491 0.600689 -0.29494
C  3.998814 -1.697024 0.390639
C  3.920679 0.677236 -0.251692
C  -3.958773 -0.558657 0.550613
C  -3.92147 1.104159 -1.254555
C  -2.551816 -0.56074 0.553577
C  -2.518309 1.106928 -1.231125
C  0.365117 -0.697304 -0.046218
C  7.000216 0.551355 -0.080643
C  -7.029161 -0.381836 0.30015
C  8.463203 0.142791 0.097925
C  -8.47438 -0.03821 -0.066339
H  2.086408 -2.701701 0.570759
H  1.922489 1.479776 -0.557881
H  4.574676 -2.592777 0.657948
H  4.44588 1.606505 -0.477767
H  -4.526433 -1.177121 1.247908
H  -4.452019 1.759494 -1.957955
H  -2.028477 -1.18096 1.29084
H  -1.94485 1.755754 -1.900148
H  -0.063885 -1.693944 0.19568
H  6.511379 -1.38826 0.427804
H  -6.451535 0.988571 -1.12919
H  8.662373 -0.200592 1.130192
H  9.097684 1.015537 -0.111775
H  8.7412 -0.672582 -0.595666
H  -8.6920 1.03144 0.111725
H  -9.146075 -0.643254 0.559051
H  -8.684312 -0.259632 -1.129415
