program: Gaussian 09
title: 000256127
version: EM64L-G09RevD.01
frameworkgroup: C1[X(C24H25O2P)]
method: RPBEPBE
basis: SDD
operation: Freq
keyword: #p
keyword: freq=noraman
keyword: PBEPBE/SDD
title: #p freq=noraman PBEPBE/SDD
converged: YES YES NO NO
title: Mulliken charges:
elementType: P O O C C C C C C C C C C C C C C C C C C C C C C C C H H H H H H H H H H H H H H H H H H H H H H H H H
charge: 0.797357 -0.324348 -0.387017 -0.113888 -0.018594 -0.060740 -0.782868 0.350216 -0.273362 -0.287004 -0.303029 -0.255572 -0.294852 -0.276262 0.400047 -0.719613 -0.710068 -0.722626 -0.231710 -0.224515 -0.236489 -0.239747 -0.234123 -0.237984 -0.223048 -0.225137 -0.224843 0.278771 0.264668 0.275076 0.257553 0.276502 0.262596 0.331872 0.216364 0.198377 0.268344 0.224264 0.224665 0.195168 0.273386 0.198989 0.211160 0.235484 0.233822 0.230860 0.237278 0.233216 0.234400 0.234953 0.231771 0.230277
chargesum: 0.00000
title: Mulliken charges with hydrogens summed into heavy atoms:
elementType: P O O C C C C C C C C C C C C C C C C C C C C C C C C
charge: 0.797357 -0.324348 -0.387017 -0.113888 -0.018594 -0.060740 -0.504097 0.350216 -0.008694 -0.011929 -0.045476 0.020931 -0.032256 0.055610 0.400047 -0.036527 -0.065972 -0.039090 0.003774 0.009307 -0.005629 -0.002469 -0.000907 -0.003584 0.011905 0.006635 0.005434
polarizability: 3.31631022e+02 -8.35851321e+00 2.78414186e+02 8.32783469e+00 -3.08344824e+00 2.74662114e+02
1716.lowfreq: -11.0409 -7.8581 -0.0018 -0.0016 -0.0016 4.3550 19.4624 24.8788 30.8996
frequency: 19.0210 24.7623 30.7484 35.8022 39.4310 43.9484 50.5572 58.5525 62.5291 85.1724 117.1980 131.9612 169.2220 179.0186 184.6225 193.0931 211.3287 229.2072 233.2866 240.6273 243.8940 246.8676 260.3440 271.8075 310.1204 335.8678 378.0138 395.5841 398.5249 400.0659 410.0906 430.1686 435.5782 443.0495 460.2140 505.5967 511.3616 516.1790 579.2948 611.1310 611.9644 612.2272 663.1634 680.9138 685.0471 696.7221 700.2114 701.3335 701.6070 706.7231 719.1734 757.4729 757.9089 761.0465 820.7520 850.5217 860.3091 862.9874 869.4903 911.8673 916.2960 935.0241 938.9450 943.3182 952.8226 982.5515 985.2586 986.7859 987.0687 987.4506 992.4080 995.1269 1002.8205 1004.1225 1016.6367 1018.0559 1019.2421 1021.1726 1030.4684 1031.3681 1073.3967 1078.8327 1081.3375 1081.6662 1082.4967 1094.8766 1101.1117 1173.4356 1174.4415 1176.1676 1185.2674 1187.2578 1195.6508 1199.8999 1250.5328 1261.9335 1308.3984 1314.9003 1319.6530 1337.2026 1369.2810 1372.9804 1373.9030 1375.8346 1379.8316 1395.3372 1424.3152 1425.8567 1427.7972 1442.5978 1462.1680 1463.6596 1464.7717 1467.1194 1467.8508 1469.4411 1479.8305 1502.7532 1542.1487 1581.0257 1585.3400 1588.3197 1592.9644 1594.4993 1597.2282 2981.6658 2984.0465 2989.9496 3072.0149 3076.0411 3090.1255 3095.2057 3113.6805 3118.0236 3118.3222 3124.4865 3125.9582 3128.1299 3129.9107 3136.5886 3137.2558 3137.9008 3146.3901 3148.6248 3150.4697 3156.3593 3163.0126 3165.2056 3168.8126 3206.0988
redmass: 3.9059 3.8264 3.6145 3.9299 3.8412 4.5422 4.8685 5.0031 4.8314 4.8671 4.7856 3.2021 1.7119 2.4458 4.0579 4.3849 4.4323 1.5480 2.4053 3.6896 3.9696 1.1565 4.8063 5.5144 3.5704 2.6066 3.7107 2.8478 2.8169 2.8413 2.8925 5.5032 2.9388 4.6126 3.2553 4.3682 5.2318 4.3393 1.1244 6.4427 6.4342 6.4105 6.3696 6.9828 6.8086 3.2539 3.5511 2.6257 2.5440 4.1499 5.3431 1.5286 1.5528 1.5560 3.2397 6.1585 1.2444 1.2471 1.2509 1.6067 1.6264 1.3615 1.3526 1.3637 1.2010 4.9348 1.4357 5.2892 5.7067 1.4421 1.7271 2.9117 1.3302 1.3206 1.4202 2.8199 3.4550 3.0367 1.4207 1.4188 1.9560 1.9908 1.8586 1.8563 1.9299 2.6202 1.8105 1.0566 1.0557 1.0551 1.4331 1.3831 1.1307 1.1503 2.9758 3.0491 1.3298 1.3560 1.4336 2.7962 1.2351 5.5185 1.4377 4.6451 9.0531 1.2307 2.1374 2.1163 2.1197 1.0474 1.3139 1.9320 1.0559 1.6159 1.0674 1.9854 1.0530 1.0620 6.2226 5.7812 5.9220 6.1675 5.5734 5.8816 5.8149 1.0366 1.0361 1.0362 1.0992 1.0988 1.0991 1.1002 1.0990 1.0984 1.0919 1.0858 1.0865 1.0879 1.0852 1.0906 1.0889 1.0912 1.0925 1.0954 1.0960 1.0966 1.1013 1.1014 1.1017 1.0903
irintensity: 0.0298 0.2963 0.0502 0.2175 0.1676 0.4162 0.9068 0.2007 0.9514 3.8395 3.3554 1.8622 0.3653 0.6237 1.3921 5.8886 2.4766 2.9819 1.1199 4.2614 2.8768 0.6699 15.4793 2.8754 18.1838 2.0148 11.3660 0.0606 0.0056 0.0661 1.6249 8.9510 1.9930 13.2377 2.2625 55.5766 55.0574 71.6383 21.6228 0.5544 1.0607 0.4154 0.3892 7.7383 10.0025 14.6904 6.5149 40.0763 27.1281 70.7237 54.2199 31.6776 52.2401 33.8345 27.7453 103.5340 0.2196 0.1131 4.6743 0.4894 0.7626 0.3287 0.1761 0.9438 0.3546 15.7890 0.6168 2.8847 2.3327 3.1590 36.7330 97.2728 0.0311 0.9078 2.2843 4.2977 5.8476 6.2152 10.6300 3.2169 32.8667 2.7828 20.9403 14.6934 8.6967 44.7798 450.8771 0.3089 0.3301 0.7001 100.3292 80.5929 5.9007 8.5950 25.7326 52.1351 1.2813 1.7572 28.6714 331.3194 40.9527 2.0814 47.5875 9.2953 0.4860 84.0902 27.2708 18.6805 22.6561 0.8275 91.7058 18.8858 1.4191 12.0221 3.0985 18.8619 2.8501 44.9037 272.2386 5.0503 2.1303 1.8664 2.9462 1.8157 1.7796 30.4623 15.3867 67.1497 12.9071 29.2920 76.0709 33.6611 4.6044 15.7042 32.8762 0.3473 5.5231 1.1218 0.0649 0.4449 1.0605 4.2772 10.4279 18.1351 23.9910 16.6636 48.8779 38.3411 28.1486 0.3735
temp: 298.150 k
press: 1.00000 atm
elementType: 15 8 8 6 6 6 6 6 6 6 6 6 6 6 6 6 6 6 6 6 6 6 6 6 6 6 6 1 1 1 1 1 1 1 1 1 1 1 1 1 1 1 1 1 1 1 1 1 1 1 1 1
symmnumber: 1
zpe: 1097883.7 jmol-1
zpe.correction: 0.418162 hartree
zpe.thermalcorrener: 0.444874 hartree
zpe.thermalcorrenthalpy: 0.445818 hartree
zpe.thermalcorrgfe: 0.358627 hartree
zpe.sumelectzpe: -1419.262591 hartree
zpe.sumelectthermal: -1419.235880 hartree
zpe.sumelectthermalent: -1419.234935 hartree
zpe.sumelectthermalfe: -1419.322127 hartree
dipole: 5.1561 0.6279 0.1086
dipole: 5.1953
quadrupole: -152.2721 -152.6199 -156.9749
quadrupole: -1.4043 3.6899 -1.7998
quadrupole: 1.6836 1.3357 -3.0193 -1.4043 3.6899 -1.7998
hfenergy: -1419.6807533 hartree
pointgroup: C01 [X(C24H25O2P1)]
dipole: 1.898076 -0.2042184 0.7304463 debye
polarizability: 332.9534754|4.8236195|274.9231392|7.0899263|-1.905581|276.8307068 unknown
InChI: InChI=1S/C24H25O2P/c1-24(2,3)26-23(25)19-27(20-13-7-4-8-14-20,21-15-9-5-10-16-21)22-17-11-6-12-18-22/h4-19H,1-3H3
charge 0 multiplicity 1
52 atoms
P  0.540337 -0.116845 0.088025
O  -2.774485 -0.625275 -2.109357
O  -2.481972 0.486245 -0.028659
C  2.185617 -0.782334 -0.488697
C  0.172717 -0.906032 1.755265
C  0.81219 1.705988 0.482226
C  -0.620316 -0.530079 -1.182074
C  -4.262139 -0.355819 -2.15155
C  3.004502 -1.558791 0.364245
C  -0.670737 -2.038783 1.784303
C  2.113161 2.264968 0.448227
C  2.606907 -0.497377 -1.812471
C  0.728177 -0.390587 2.949578
C  -0.308791 2.512776 0.808591
C  -1.988162 -0.164849 -1.022446
C  -4.52415 1.165588 -2.175491
C  -4.668459 -1.009004 -3.486047
C  -4.953568 -1.049858 -0.958244
C  4.241459 -2.054269 -0.108542
C  -0.949904 -2.669801 3.016859
C  2.295281 3.636476 0.741486
C  3.84262 -0.99656 -2.279706
C  0.447637 -1.026541 4.180482
C  -0.113999 3.882121 1.096359
C  4.662389 -1.774693 -1.428583
C  -0.388883 -2.167035 4.214514
C  1.183268 4.446521 1.065847
H  -0.253318 -1.092319 -2.039946
H  2.677493 -1.788096 1.383913
H  -1.109232 -2.40206 0.847014
H  2.980197 1.645627 0.19324
H  1.972244 0.107165 -2.469851
H  1.355994 0.507583 2.925581
H  -1.308632 2.062434 0.815933
H  -3.957314 1.63645 -2.998813
H  -5.601228 1.35592 -2.341302
H  -4.217533 1.625403 -1.223246
H  -4.41313 -2.083015 -3.481877
H  -4.137479 -0.52975 -4.326941
H  -5.756975 -0.903143 -3.646373
H  -4.608735 -0.613006 -0.008037
H  -6.050085 -0.925974 -1.036713
H  -4.725669 -2.131261 -0.961437
H  4.869929 -2.660382 0.552863
H  -1.610904 -3.542902 3.044018
H  3.302516 4.067122 0.715664
H  4.163107 -0.777161 -3.303797
H  0.873461 -0.62868 5.108193
H  -0.979081 4.507371 1.343558
H  5.6206 -2.161571 -1.792731
H  -0.610858 -2.65455 5.170545
H  1.326635 5.509341 1.291704
