program: Gaussian 09
title: 000264108
version: EM64L-G09RevD.01
frameworkgroup: C1[X(C10H3Cl9O3)]
method: RPBEPBE
basis: SDD
operation: Freq
keyword: #p
keyword: freq=noraman
keyword: PBEPBE/SDD
title: #p freq=noraman PBEPBE/SDD
converged: YES YES NO NO
title: Mulliken charges:
elementType: Cl Cl Cl Cl Cl Cl Cl Cl Cl O O O C C C C C C C C C C H H H
charge: 0.094868 0.108157 0.149375 0.106313 0.079606 0.093035 0.142111 0.159300 0.134795 -0.173774 -0.361476 -0.141086 -0.158507 -0.294960 -0.171366 -0.165448 -0.502065 0.266863 0.049241 -0.045231 0.190087 -0.703063 0.380813 0.375631 0.386781
chargesum: 0.00000
title: Mulliken charges with hydrogens summed into heavy atoms:
elementType: Cl Cl Cl Cl Cl Cl Cl Cl Cl O O O C C C C C C C C C C
charge: 0.094868 0.108157 0.149375 0.106313 0.079606 0.093035 0.142111 0.159300 0.134795 -0.173774 0.025305 -0.141086 0.222305 0.080671 -0.171366 -0.165448 -0.502065 0.266863 0.049241 -0.045231 0.190087 -0.703063
polarizability: 1.94212297e+02 -1.58236434e+01 1.98479875e+02 8.04587401e+00 -6.22840709e+00 1.87182172e+02
1716.lowfreq: -7.7082 -4.8594 -0.0018 0.0010 0.0022 7.8510 35.7040 48.2450 51.8307
frequency: 35.6283 48.2431 51.8286 80.3470 80.8681 98.3175 116.7167 118.0460 131.7011 140.3775 148.7256 156.5377 161.0435 171.5489 180.4556 186.3407 214.0014 238.1348 256.5551 267.8373 272.0326 296.5221 309.9530 320.8888 341.0994 350.3200 363.3161 371.3075 389.3508 416.2914 464.3153 495.0500 528.7551 558.2672 589.0622 606.1224 640.0904 651.9339 677.9414 709.9803 738.4083 754.8889 768.0471 786.5895 841.7728 844.8345 860.6431 883.6538 951.0084 976.2651 1002.1065 1005.5653 1027.6312 1038.1750 1070.8739 1082.8171 1097.8002 1118.0849 1152.3867 1221.0694 1237.8545 1261.2517 1325.0398 1349.2312 1594.2971 1733.2076 3080.0273 3089.6636 3515.5854
redmass: 23.0645 21.8764 24.8314 25.1076 22.4101 27.7937 25.5317 24.8256 23.9083 28.5854 31.6141 34.6070 24.6197 24.2123 25.4017 19.2662 15.4397 19.1544 17.7007 11.3792 9.5192 20.4297 6.9905 6.9417 6.2794 29.4431 5.6508 13.7776 4.6080 3.5020 8.8462 8.7339 8.3387 8.2411 8.9914 11.0783 10.2578 10.0284 9.6505 10.2233 8.4928 10.8442 10.1345 8.0836 10.1594 8.0986 9.2529 9.2210 7.0276 3.5401 5.9717 8.0390 4.9248 7.9290 4.0023 3.7687 3.3151 5.4470 9.1726 1.8176 1.5032 1.4813 1.5209 1.6172 12.0313 13.0324 1.0848 1.0860 1.0649
irintensity: 0.1109 0.1516 0.0366 0.7112 0.6969 0.4679 0.4651 0.1935 0.2654 0.1563 0.1721 0.0135 0.0832 0.3825 0.0601 1.1276 0.2457 0.6384 0.9872 4.3820 3.6568 1.6082 8.5436 13.0490 19.2873 0.3825 32.9198 4.2550 53.8052 56.3516 5.3583 78.5718 2.3941 7.4173 14.5180 10.4545 75.3498 48.8440 25.6122 16.6395 97.0244 101.5912 81.1681 10.4330 160.4925 40.9628 26.9331 44.6984 12.6069 14.2434 19.5980 35.8208 80.6206 41.0172 24.7256 22.1125 126.2119 76.6411 23.4031 2.2879 57.8986 24.2101 12.7474 53.9629 55.4091 256.8813 0.8574 1.5062 47.2462
temp: 298.150 k
press: 1.00000 atm
elementType: 17 17 17 17 17 17 17 17 17 8 8 8 6 6 6 6 6 6 6 6 6 6 1 1 1
symmnumber: 1
zpe: 296940.9 jmol-1
zpe.correction: 0.113099 hartree
zpe.thermalcorrener: 0.135589 hartree
zpe.thermalcorrenthalpy: 0.136533 hartree
zpe.thermalcorrgfe: 0.060433 hartree
zpe.sumelectzpe: -4747.389437 hartree
zpe.sumelectthermal: -4747.366947 hartree
zpe.sumelectthermalent: -4747.366002 hartree
zpe.sumelectthermalfe: -4747.442102 hartree
dipole: 1.6339 -1.7614 0.1116
dipole: 2.4051
quadrupole: -187.8255 -202.3620 -180.3436
quadrupole: -2.0498 1.2883 0.2080
quadrupole: 2.3516 -12.1850 9.8334 -2.0498 1.2883 0.2080
hfenergy: -4747.5025359 hartree
pointgroup: C01 [X(C10H3Cl9O3)]
dipole: -0.5902769 -0.7376513 0.0529291 debye
dipolederiv: -0.116578 -0.0542811 0.0083795 -0.0769245 -0.4987554 -0.0374445 0.0171939 -0.0127214 -0.0663553 -0.2749681 -0.1837267 -0.1149365 -0.1753078 -0.2492286 -0.1302372 -0.1295828 -0.1567385 -0.1646141 -0.5381696 0.2019451 0.0657355 0.1988733 -0.1356197 0.0026456 0.1095499 -0.0204682 -0.1437738 -0.209178 0.0259416 0.1165621 0.0264172 -0.1181113 0.1383604 0.1233757 0.1391709 -0.693968 0.0109246 -0.0268947 0.0058005 -0.0404242 -0.0913541 -0.181325 -0.0359503 -0.2599748 -0.5576062 -0.0730133 -0.2147388 0.1329075 -0.2113419 -0.3073658 0.2157647 0.1921965 0.299192 -0.227578 -0.5194744 0.1248845 -0.2369529 0.1171902 -0.1444469 0.0941843 -0.2620954 0.1219611 -0.3837779 -0.1930172 -0.0788669 0.0048227 -0.0721045 -0.6675677 0.1005211 0.0136669 0.1324285 -0.1175375 -0.2113212 -0.0035735 0.0220497 -0.0107354 -0.2749216 -0.2567668 0.0195785 -0.2604877 -0.5268155 -0.9474489 -0.5424419 -0.1063352 -0.4475451 -1.0395292 -0.1618383 -0.3133088 -0.1868477 -0.3844199 -0.5609435 -0.1242061 0.1402888 -0.2652842 -0.464358 -0.1379709 0.0397259 -0.2211636 -0.684055 -0.4433502 -0.0711451 -0.0556761 -0.1432716 -1.0510485 -0.0361633 -0.1323794 0.0670422 -0.2899144 -0.1838704 -0.0469445 -0.060456 -0.0361405 -0.1964355 0.0098213 0.0599938 0.0784503 -0.0527208 -0.2401493 0.1002204 -0.1078062 0.1171352 -0.2495634 0.0191217 -0.2324427 0.0149111 -0.1045757 0.2273349 0.0294094 0.0242873 0.1268501 0.7761325 0.0090574 -0.0584841 -0.0009661 -0.0306652 0.4843432 0.2631688 0.2761982 0.1894667 0.3501303 0.2746924 0.1924509 0.311085 0.1755784 0.7718252 -0.3172921 -0.2390582 -0.3090167 0.1810334 -0.2253801 -0.2615487 -0.1964488 1.0190501 0.7785632 0.0993739 -0.2347432 0.4535716 0.7646512 0.2122375 -0.1266781 0.0289774 0.5314264 -0.06643 0.0364965 0.0285509 0.0021659 -0.043961 0.4426583 0.0946002 0.3862562 0.6861038 -0.0172547 0.285382 -0.2970645 0.3084389 0.3471683 -0.4563584 -0.2406286 -0.4375115 0.0986296 1.0697971 0.4646635 0.2963434 0.1722254 1.5532428 0.0353065 0.6961899 0.1268251 0.4479669 0.7625518 -0.0623533 0.3388212 -0.0615991 1.1540993 0.0311813 0.2464231 0.0213483 1.0243011 0.1128472 -0.0322535 0.038015 -0.0056219 0.0593921 -0.0005286 0.0514219 0.0236035 0.0360101 0.0968873 0.0200557 0.0507598 0.0025009 0.0666657 -0.0046541 0.0154176 -0.0270182 0.0381137 0.2800923 0.1071766 -0.0964931 0.140482 0.2797512 0.0431147 -0.0786856 0.0290951 0.3711974 unknown
polarizability: 192.2464123|16.2234285|202.0607268|5.6634477|4.7286274|185.5672047 unknown
InChI: InChI=1S/C10H3Cl9O3/c11-3-4(12)7(14)2-1(6(3,13)9(7,15)16)5(20)22-8(2,21)10(17,18)19/h1-2,21H
charge 0 multiplicity 1
25 atoms
Cl 0.473881 -3.08388 -0.159126
Cl 2.814083 1.881455 1.41032
Cl 3.548465 -1.500255 0.56157
Cl 1.527469 -1.202746 2.741591
Cl 1.187837 -1.263621 -2.947634
Cl 2.533533 1.843722 -1.966565
Cl -4.413521 0.178785 -0.844625
Cl -3.294916 -2.165369 0.697192
Cl -3.20187 0.606608 1.903534
O  -1.58764 1.330853 -0.625855
O  -1.567894 -0.848288 -1.570312
O  -0.33335 3.165419 0.062118
C  -0.472478 -0.481971 0.575808
C  0.171108 0.887718 0.962215
C  0.73805 -1.278934 -0.048469
C  1.691023 0.700934 0.586061
C  1.881519 -0.819495 0.948611
C  -1.665416 -0.131332 -0.357339
C  1.25239 -0.584096 -1.321124
C  1.80869 0.60049 -0.942042
C  -0.544125 1.955012 0.129767
C  -3.069137 -0.365829 0.322703
H  -0.820903 -1.037599 1.458347
H  0.077422 1.119137 2.03433
H  -2.293321 -0.574917 -2.193577
