program: Gaussian 09
title: 000268518
version: EM64L-G09RevD.01
frameworkgroup: C1[X(C8H11NO)]
method: RPBEPBE
basis: SDD
operation: Freq
keyword: #p
keyword: freq=noraman
keyword: PBEPBE/SDD
title: #p freq=noraman PBEPBE/SDD
converged: YES YES NO NO
title: Mulliken charges:
elementType: O N C C C C C C C C H H H H H H H H H H H
charge: -0.444593 -0.039783 0.300880 -0.500318 0.018563 -0.357679 -0.317125 -0.771209 -0.192340 -0.365903 0.219122 0.216614 0.204341 0.222506 0.301913 0.224177 0.260813 0.217620 0.227200 0.238156 0.337044
chargesum: 0.00000
title: Mulliken charges with hydrogens summed into heavy atoms:
elementType: O N C C C C C C C C
charge: -0.107549 -0.039783 0.300880 -0.064581 0.018563 0.069167 -0.015212 -0.068599 0.034860 -0.127746
polarizability: 1.08994641e+02 -6.12879944e+00 1.09043115e+02 -2.14572821e-01 -1.14196464e+00 5.70366936e+01
1716.lowfreq: -0.0003 0.0003 0.0003 5.3454 9.9471 12.8817 47.9681 119.5301 148.3020
frequency: 47.8015 119.5282 148.2884 156.7807 200.1938 241.0518 277.4571 308.1375 380.3068 437.0366 479.3358 500.7218 539.9305 585.7421 712.6327 744.6393 798.3694 832.6491 851.9847 936.0874 951.3355 960.9504 976.2588 997.7465 1042.6363 1049.5906 1066.0698 1105.8237 1139.9072 1181.3741 1238.7002 1256.7059 1279.1622 1308.7823 1317.6084 1349.9334 1383.9250 1390.5017 1422.2913 1438.1445 1444.1430 1463.2310 1472.4239 1475.3343 1556.6855 1586.8510 2939.9690 2966.9404 2971.2405 3001.8730 3044.9461 3075.7741 3116.0554 3124.5467 3149.5548 3168.2305 3566.0600
redmass: 3.7040 2.9484 1.2229 2.6925 2.4489 3.6424 2.2367 1.1791 2.9491 3.4838 3.2063 3.0578 3.6602 4.7252 3.9365 3.0564 1.3322 4.1947 2.9173 1.5889 1.8765 1.7164 1.4899 1.5282 1.6132 2.7899 2.3814 1.9188 1.2055 1.5655 1.2719 2.2644 1.6490 3.4656 1.5973 1.5167 1.2160 1.2399 1.6430 2.9013 1.1857 1.1158 1.0513 1.0832 5.8350 5.5863 1.0652 1.0700 1.0395 1.0915 1.0962 1.0959 1.0970 1.0881 1.0923 1.0989 1.0662
irintensity: 4.5794 0.7514 1.9232 1.9596 9.8102 3.9035 26.1879 157.2488 3.3563 0.5973 13.8509 1.0333 9.0472 8.6373 0.4064 9.0104 39.6287 2.7457 7.1318 12.7620 3.0577 3.6348 41.5568 42.6725 2.8699 4.5517 2.0983 7.1850 26.6437 5.1619 4.5233 0.5915 7.6647 2.2758 6.6825 18.4527 13.3456 16.3942 1.0394 58.3383 21.2249 15.3303 19.4847 7.4833 14.0029 7.5744 21.0824 80.2488 23.7663 34.7820 22.0147 27.3406 11.0629 13.6219 17.1555 17.9380 4.7258
temp: 298.150 k
press: 1.00000 atm
elementType: 8 7 6 6 6 6 6 6 6 6 1 1 1 1 1 1 1 1 1 1 1
symmnumber: 1
zpe: 456255.6 jmol-1
zpe.correction: 0.173779 hartree
zpe.thermalcorrener: 0.183688 hartree
zpe.thermalcorrenthalpy: 0.184633 hartree
zpe.thermalcorrgfe: 0.138428 hartree
zpe.sumelectzpe: -440.655444 hartree
zpe.sumelectthermal: -440.645534 hartree
zpe.sumelectthermalent: -440.644590 hartree
zpe.sumelectthermalfe: -440.690794 hartree
dipole: -2.2819 1.4056 -0.3995
dipole: 2.7097
quadrupole: -66.5799 -55.1076 -58.7634
quadrupole: -8.5749 2.3667 -0.3828
quadrupole: -6.4296 5.0427 1.3869 -8.5749 2.3667 -0.3828
hfenergy: -440.8292224 hartree
pointgroup: C01 [X(C8H11N1O1)]
dipole: 0.9976554 0.2601869 0.2711731 debye
dipolederiv: -0.744106 0.1777022 0.0384757 0.1987314 -0.5942348 0.2625362 0.0300369 0.2886125 -0.3215239 -0.3953101 -0.0905838 -0.0210037 0.0027332 -0.4305194 -0.0352749 -0.0166389 -0.0423213 -0.258488 0.2313243 0.1752356 0.0656939 0.0682878 -0.3282915 -0.0610304 0.0774183 -0.042956 -0.0195212 -0.0668296 0.0460382 0.0121885 0.0633275 -0.0366184 0.0263962 0.0126907 -0.0486296 0.1046543 0.0326098 0.0134629 0.0083498 0.1233648 0.6179556 0.1252291 0.0265558 0.1023633 0.0151319 0.4555824 -0.0891297 0.0026851 -0.1021692 0.5003266 -0.2021074 -0.0251279 -0.19842 0.3860233 0.025987 0.0057583 0.0113909 -0.0714488 0.0795863 0.0272021 0.0118767 0.0187216 -0.1213991 0.0070562 -0.1005488 -0.018785 -0.0476958 -0.2345556 -0.0546561 -0.0087606 -0.0314598 0.0604555 -0.2344067 -0.0241148 -0.0111249 0.1273041 0.0416653 0.0403239 0.0079875 0.0252572 -0.1235542 0.3475317 0.115124 0.0463703 -0.0556527 0.1002743 0.0289699 0.0231007 0.0438905 -0.0775692 -0.0460332 -0.016329 -0.0466383 -0.0116754 0.0802473 -0.0476664 -0.0753942 -0.0770395 -0.1282589 0.0055402 -0.0003407 -0.0082164 -0.0393657 -0.0854463 0.0964856 0.0425031 0.1056324 0.0432098 -0.2213613 -0.0923931 0.0305244 -0.1027644 -0.0610441 0.0636501 -0.0243924 0.0276051 0.0583111 0.1053594 -0.0081703 -0.0683368 0.0242067 0.0161055 -0.0606346 -0.0268894 -0.0146761 -0.1110397 0.1115185 0.0626553 0.0209585 0.0693466 0.0472226 -0.014009 0.0253297 -0.0099714 0.1389587 0.0429232 -0.0879766 0.0983634 -0.0511782 0.0040694 0.0307129 0.1005083 0.0803792 -0.0342571 -0.0377549 0.1437428 0.0357578 0.043411 0.0623328 -0.0152825 0.0140467 -0.0197154 0.1130395 0.029323 -0.0414011 -0.1305827 -0.0094274 0.0409583 0.0023777 -0.1170188 -0.058532 -0.0619491 0.0664768 -0.0466048 -0.0134935 -0.0748862 -0.102738 -0.0506869 -0.0199753 -0.0462969 0.1500012 -0.1252319 -0.0843086 -0.0316389 -0.0564953 0.0601824 -0.0170337 -0.0241798 -0.0207105 0.1319574 0.4098013 -0.0578178 -0.0209382 -0.0979541 0.2225217 -0.145502 -0.0336772 -0.0817335 0.0558179 unknown
polarizability: 111.8077229|4.5497371|104.6147593|4.938524|7.9308089|58.6519677 unknown
InChI: InChI=1S/C8H11NO/c1-7-8(4-6-10)3-2-5-9-7/h2-3,5,10H,4,6H2,1H3
charge 0 multiplicity 1
21 atoms
O  2.850745 -1.645348 0.50892
N  -2.139615 0.744179 0.04965
C  0.24005 0.133751 0.070036
C  1.688633 0.584982 0.222645
C  -0.820619 1.088623 0.188554
C  2.771151 -0.39567 -0.26825
C  -0.111452 -1.21491 -0.18618
C  -0.548442 2.552937 0.475562
C  -1.471128 -1.569711 -0.333736
C  -2.447788 -0.559958 -0.209832
H  1.889289 0.842354 1.286722
H  1.828057 1.534879 -0.333037
H  3.756669 0.116247 -0.268989
H  2.556577 -0.730567 -1.297286
H  0.673759 -1.974399 -0.247455
H  -0.004741 3.039176 -0.358403
H  -1.509189 3.071916 0.612848
H  0.066796 2.688839 1.385328
H  -1.766877 -2.605003 -0.531838
H  -3.515377 -0.785986 -0.315751
H  3.018603 -1.425829 1.459994
