program: Gaussian 09
title: 000268513
version: EM64L-G09RevD.01
frameworkgroup: C1[X(C10H8N2OS)]
method: RPBEPBE
basis: SDD
operation: Freq
keyword: #p
keyword: freq=noraman
keyword: PBEPBE/SDD
title: #p freq=noraman PBEPBE/SDD
converged: NO YES NO NO
title: Mulliken charges:
elementType: S O N N C C C C C C C C C C H H H H H H H H
charge: 0.175740 -0.177521 -0.003245 -0.546101 0.352980 -0.261294 -0.148692 -0.369069 -0.369215 0.041006 -0.210375 -0.210389 -0.113559 -0.239325 0.240406 0.236014 0.235997 0.225426 0.225422 0.227331 0.338176 0.350290
chargesum: 0.00000
title: Mulliken charges with hydrogens summed into heavy atoms:
elementType: S O N N C C C C C C C C C C
charge: 0.175740 -0.177521 -0.003245 0.142364 0.352980 -0.020888 -0.148692 -0.133055 -0.133219 0.041006 0.015051 0.015033 -0.113559 -0.011994
polarizability: 2.28676670e+02 -1.20830042e+01 1.10059632e+02 5.85592036e-02 4.39914593e-02 9.63647975e+01
1716.lowfreq: -57.2968 -0.0022 -0.0021 -0.0018 3.0392 3.7603 6.7119 42.3310 62.1888
frequency: -57.2922 42.2692 62.1805 93.1662 173.0970 186.4713 235.0756 317.6163 328.8142 377.8163 400.4747 411.7653 439.7133 447.6517 510.7023 524.3515 552.9584 571.5021 604.7431 614.1451 616.2679 693.8939 706.1281 745.9427 764.1834 802.6592 840.7700 854.4296 901.9080 940.9095 972.5511 986.8137 993.6692 1025.6326 1028.7941 1079.4022 1168.2574 1172.7849 1187.9379 1219.5970 1285.5415 1301.5141 1308.8174 1368.9103 1428.1579 1476.3009 1568.3123 1584.2110 1601.5639 1608.9008 1633.3487 1671.9926 3079.0476 3124.4217 3131.0000 3142.9847 3152.3983 3166.5861 3531.9659 3682.8987
redmass: 4.0318 6.3821 6.1281 6.7182 7.1846 5.9600 6.2086 4.3097 5.2734 3.0022 2.7102 5.9777 1.2162 7.8436 6.2619 1.4370 4.8333 6.9322 8.3088 6.2847 3.0913 3.5832 1.8336 10.9074 2.2437 5.7726 1.4259 1.3576 1.7793 2.7613 1.3860 5.6693 1.3455 2.7741 2.4104 1.5991 3.4304 1.0515 1.1229 2.6543 3.6291 1.4528 1.3707 6.4794 2.2383 2.3081 4.3602 5.9964 1.9618 4.0319 5.7421 6.5762 1.0886 1.0843 1.0876 1.0926 1.0970 1.1019 1.0452 1.1049
irintensity: 0.6163 6.0428 3.3098 0.7341 5.2966 2.9967 2.2501 1.5365 0.6124 2.9827 0.8380 7.6251 30.0183 8.1963 30.0297 213.2312 11.4797 14.0275 3.0097 0.2231 68.8523 4.4673 71.9537 10.8301 27.6758 16.9746 9.6261 10.8420 3.3958 7.9234 0.3205 6.0206 0.9855 53.2263 107.5046 10.4901 155.6456 0.0356 0.2354 0.4006 173.9243 24.2362 0.0935 0.0037 6.6399 10.1810 484.1286 1.5881 137.2852 108.8525 98.5509 174.3069 11.4888 1.2560 0.3518 18.2158 40.7256 23.8170 156.6021 49.0969
temp: 298.150 k
press: 1.00000 atm
elementType: 16 8 7 7 6 6 6 6 6 6 6 6 6 6 1 1 1 1 1 1 1 1
symmnumber: 1
zpe: 415378.8 jmol-1
zpe.correction: 0.158209 hartree
zpe.thermalcorrener: 0.169728 hartree
zpe.thermalcorrenthalpy: 0.170672 hartree
zpe.thermalcorrgfe: 0.119836 hartree
zpe.sumelectzpe: -967.658252 hartree
zpe.sumelectthermal: -967.646734 hartree
zpe.sumelectthermalent: -967.645790 hartree
zpe.sumelectthermalfe: -967.696626 hartree
dipole: 3.7499 -3.1736 0.0079
dipole: 4.9126
quadrupole: -51.3839 -96.4862 -84.3022
quadrupole: -1.2528 0.0134 0.0422
quadrupole: 26.0068 -19.0954 -6.9114 -1.2528 0.0134 0.0422
hfenergy: -967.8164616 hartree
pointgroup: C01 [X(C10H8N2O1S1)]
dipole: 1.4083503 1.3236634 0.0006832 debye
dipolederiv: -0.6958053 0.1326292 0.0001617 0.1125257 -0.6329062 -0.0006056 0.0002242 -0.0007349 0.0199944 -0.8749259 -0.3198866 0.0001176 -0.2029539 -0.7959714 -0.000136 -0.0007747 -0.00071 -0.2667065 -1.6821353 -0.4244495 -0.0000417 -0.3003452 -0.9186303 -0.0003378 0.0000932 -0.0004961 -0.2539202 -1.7372808 0.0275888 0.0003276 0.1744629 -0.2633764 0.0003439 0.0006753 0.0004 -0.645777 0.2575463 0.0071971 -0.0000509 0.0612271 -0.0191524 0.0000057 0.0005267 0.0000482 0.0074581 0.1920773 -0.0237357 0.0001017 0.0656668 0.123587 0.0001146 -0.0001908 0.0001717 -0.1419749 0.4996571 0.2331203 0.0002133 0.6534797 -0.3126723 -0.0002575 0.0007209 0.000113 -0.0753219 -0.2089137 0.0525097 -0.0832683 -0.0263799 -0.1097863 0.003468 0.0542876 -0.0220837 0.0650716 -0.2084021 0.0526497 0.0828998 -0.0270352 -0.1099401 -0.0030453 -0.05485 0.0223555 0.0652304 1.7690655 0.4094579 -0.0001468 -0.3238833 1.034604 0.0003676 0.0000299 0.0005769 0.226164 -0.0340792 0.0594938 0.0699148 0.0579526 -0.1109025 0.0406791 0.0283114 0.0437926 0.0801549 -0.0343769 0.0594489 -0.0700389 0.0580363 -0.1111573 -0.040265 -0.0287884 -0.0434562 0.0799973 2.0748917 -0.0330881 -0.0007495 0.0603248 1.4297051 0.0010256 -0.0004782 0.0012996 0.129657 0.0437947 0.1078216 0.0000355 0.0963842 -0.1161617 0.0001131 0.0002592 0.0001843 -0.0730963 -0.0201185 -0.064524 -0.0000236 -0.0957315 -0.037625 -0.0001584 -0.0004506 -0.0002683 0.1485749 0.0774169 -0.0508182 0.094031 -0.0316502 0.1171303 0.027415 0.0852 0.0255734 -0.0439782 0.0777684 -0.0509448 -0.0938298 -0.0317439 0.1171322 -0.0278167 -0.0849711 -0.0258638 -0.0442272 0.0159374 -0.0405851 -0.081159 -0.0618075 0.1363418 -0.0366636 -0.1007478 -0.0360627 -0.0735024 0.0155781 -0.0405577 0.0814412 -0.0616339 0.1364649 0.0362967 0.101 0.0357147 -0.0733572 -0.1052645 -0.1048612 -0.000065 -0.1171608 0.1146655 -0.0001031 -0.0000694 -0.000104 0.087001 0.3181785 0.0290724 0.0000866 0.0576814 0.1403457 -0.0002669 0.0000911 -0.0002531 0.3873372 0.2593904 -0.0175384 0.0000429 -0.1174162 0.1883053 -0.0001734 -0.0000985 -0.0001971 0.3952212 unknown
polarizability: 227.0998056|18.1812819|111.6361004|-0.0270775|0.0843611|96.3651933 unknown
InChI: InChI=1S/C10H8N2OS/c11-10-12-9(13)8(14-10)6-7-4-2-1-3-5-7/h1-6H,11H2
charge 0 multiplicity 1
22 atoms
S  2.705764 1.589377 0.001658
O  0.444694 -1.693662 -0.001597
N  2.754018 -1.15636 -0.001081
N  4.889427 -0.132096 -0.000996
C  -1.442786 0.628079 0.000562
C  -0.102079 1.29221 0.001248
C  1.106721 0.6657 0.000854
C  -2.101385 0.344832 -1.223157
C  -2.103446 0.346629 1.223585
C  1.366233 -0.842333 0.000004
C  -3.394606 -0.22256 -1.222205
C  -3.396646 -0.220819 1.221285
C  3.529191 -0.093268 -0.000333
C  -4.046958 -0.506911 -0.000799
H  -0.114959 2.392727 0.002131
H  -1.594109 0.553475 -2.171551
H  -1.597778 0.556664 2.172534
H  -3.888661 -0.447411 -2.174057
H  -3.892285 -0.444323 2.172632
H  -5.049237 -0.949475 -0.00132
H  5.451465 0.715919 -0.000373
H  5.344619 -1.044496 -0.002122
