program: Gaussian 09
title: 000269726
version: EM64L-G09RevD.01
frameworkgroup: C1[X(C11H12N2O2)]
method: RPBEPBE
basis: SDD
operation: Freq
keyword: #p
keyword: freq=noraman
keyword: PBEPBE/SDD
title: #p freq=noraman PBEPBE/SDD
converged: YES YES NO NO
title: Mulliken charges:
elementType: O O N N C C C C C C C C C C C H H H H H H H H H H H H
charge: -0.413494 -0.431352 -0.083118 -0.052989 -0.265908 0.391139 0.214402 -0.377502 -0.351893 -0.066245 -0.453445 -0.390318 -0.299286 -0.251924 -0.219313 0.227131 0.206923 0.209780 0.221580 0.205371 0.267803 0.271179 0.266886 0.236222 0.238837 0.338240 0.361294
chargesum: 0.00000
title: Mulliken charges with hydrogens summed into heavy atoms:
elementType: O O N N C C C C C C C C C C C
charge: -0.075253 -0.070058 -0.083118 -0.052989 -0.038777 0.391139 0.214402 0.039201 0.075057 -0.066245 -0.185642 -0.119140 -0.032400 -0.015702 0.019525
polarizability: 1.83283307e+02 -9.30185049e+00 1.44372476e+02 -1.02417590e+01 2.01906161e+01 8.74285659e+01
1716.lowfreq: -0.0009 -0.0009 0.0003 2.5999 8.2687 10.7635 41.2423 67.3263 88.1056
frequency: 41.1991 67.2993 88.0885 117.4699 148.2728 170.7354 175.3624 195.8747 248.6822 288.3304 337.8798 366.6007 383.1104 411.8324 434.9005 461.8711 475.9080 503.5946 536.6943 590.3555 602.1439 659.8354 687.8770 776.0174 793.6062 802.8704 835.2477 880.8840 893.2328 910.7615 941.4336 967.2597 974.2336 998.4096 1003.2949 1017.2458 1024.9550 1029.7693 1074.9048 1087.8836 1119.2048 1151.5642 1162.1467 1172.1622 1186.3293 1228.2159 1252.7488 1261.1796 1290.1106 1327.8869 1334.6978 1348.1862 1372.8649 1391.2038 1394.1282 1409.8063 1442.2553 1465.4058 1488.1247 1493.6010 1511.0482 1557.9240 1617.9646 2960.5681 2966.0336 2990.0061 3062.8850 3068.2209 3136.3469 3150.8706 3165.0770 3175.4037 3180.8338 3560.4025 3563.7420
redmass: 6.2402 5.2344 3.6070 3.1987 5.2981 4.0313 3.2079 3.3341 4.7304 1.4961 2.0838 1.1572 5.8241 4.4447 4.4676 3.7972 3.7693 5.4237 7.5638 3.5153 4.2482 3.5309 4.4144 1.3677 3.2541 5.9226 6.2578 1.5699 1.3918 1.6830 3.6563 2.9487 1.5711 3.9416 1.3530 3.3145 2.8890 2.0926 2.9583 2.8651 2.7015 1.6629 1.5141 1.3390 1.2426 3.4213 1.2492 1.5975 1.7271 1.2960 1.2348 1.3518 1.2335 1.6720 2.1142 1.8401 3.0217 1.0991 1.1197 2.8674 4.9188 6.5586 6.1352 1.0674 1.0681 1.0809 1.0950 1.0991 1.0862 1.0893 1.0953 1.1001 1.0919 1.0663 1.0664
irintensity: 0.9147 1.4310 4.1229 8.5560 3.4366 1.4836 3.8914 4.4640 8.9190 104.9001 100.3330 246.1656 0.6770 2.9218 2.5434 5.0979 2.9428 7.5302 2.6444 6.9824 1.2083 0.5084 2.8846 69.9477 11.2042 1.4843 2.5345 2.1155 9.2970 5.8018 94.8504 4.8029 1.3022 35.1793 0.4145 10.5662 43.7501 36.3625 0.4435 7.7759 8.5070 8.0001 6.4083 44.0065 3.1620 3.8199 17.1956 1.1430 5.4824 2.2150 2.8738 2.8629 25.3385 7.6039 4.9121 7.5662 15.2628 2.6179 10.2913 14.5090 7.8683 12.8007 2.6703 21.0687 90.0178 19.9354 16.7171 44.7077 3.2122 7.7825 10.1171 18.9141 6.4990 6.7435 7.1726
temp: 298.150 k
press: 1.00000 atm
elementType: 8 8 7 7 6 6 6 6 6 6 6 6 6 6 6 1 1 1 1 1 1 1 1 1 1 1 1
symmnumber: 1
zpe: 556054.6 jmol-1
zpe.correction: 0.211790 hartree
zpe.thermalcorrener: 0.225267 hartree
zpe.thermalcorrenthalpy: 0.226211 hartree
zpe.thermalcorrgfe: 0.171478 hartree
zpe.sumelectzpe: -685.166253 hartree
zpe.sumelectthermal: -685.152776 hartree
zpe.sumelectthermalent: -685.151831 hartree
zpe.sumelectthermalfe: -685.206565 hartree
dipole: 0.4093 4.7562 1.8593
dipole: 5.1231
quadrupole: -76.8531 -108.5505 -86.3914
quadrupole: -3.1784 -3.3326 2.5820
quadrupole: 13.7453 -17.9522 4.2069 -3.1784 -3.3326 2.5820
hfenergy: -685.3780426 hartree
pointgroup: C01 [X(C11H12N2O2)]
dipole: 0.288753 -1.9554041 0.3944111 debye
polarizability: 181.2250096|11.4830387|146.2648359|-11.2489595|-20.6469451|87.594503 unknown
InChI: InChI=1S/C11H12N2O2/c14-6-8(7-15)10-5-12-13-11-4-2-1-3-9(10)11/h1-5,8,14-15H,6-7H2
charge 0 multiplicity 1
27 atoms
O  2.777351 0.094852 -2.485203
O  1.623748 -1.363351 2.209042
N  -1.520879 2.056468 -0.413957
N  -0.279813 2.516018 -0.674222
C  1.977972 -0.585899 -0.180155
C  0.726102 0.277157 -0.291452
C  -0.591784 -0.242564 -0.020608
C  3.151238 -0.131829 -1.088262
C  2.49957 -0.63248 1.294503
C  -1.689888 0.700144 -0.106628
C  0.801617 1.639784 -0.621336
C  -0.893531 -1.608495 0.310739
C  -3.033151 0.268888 0.137352
C  -2.21356 -2.004094 0.538989
C  -3.291986 -1.063859 0.454823
H  1.721345 -1.629007 -0.454977
H  3.963072 -0.886496 -1.011481
H  3.562869 0.837239 -0.756182
H  3.451347 -1.19103 1.325193
H  2.683803 0.403396 1.650219
H  1.747448 2.114585 -0.890751
H  -0.087224 -2.342591 0.395313
H  -3.824967 1.020565 0.062299
H  -2.430109 -3.048335 0.789658
H  -4.317755 -1.398852 0.640919
H  2.362868 -0.725336 -2.854647
H  0.785097 -0.85528 2.350511
