program: Gaussian 09
title: 000269715
version: EM64L-G09RevD.01
frameworkgroup: C1[X(C10H22N2O)]
method: RPBEPBE
basis: SDD
operation: Freq
keyword: #p
keyword: freq=noraman
keyword: PBEPBE/SDD
title: #p freq=noraman PBEPBE/SDD
converged: YES YES NO NO
title: Mulliken charges:
elementType: O N N C C C C C C C C C C H H H H H H H H H H H H H H H H H H H H H H
charge: -0.439900 -0.106368 -0.077810 0.007069 -0.406053 -0.363952 -0.386104 -0.298936 -0.761841 -0.346723 -0.393457 -0.324118 -0.692082 0.194228 0.183568 0.193178 0.204808 0.183446 0.206037 0.185924 0.165266 0.211513 0.211957 0.228867 0.222087 0.166776 0.224546 0.214256 0.203315 0.233211 0.189048 0.208783 0.209490 0.219660 0.330312
chargesum: 0.00000
title: Mulliken charges with hydrogens summed into heavy atoms:
elementType: O N N C C C C C C C C C C
charge: -0.109589 -0.106368 -0.077810 0.201298 -0.029307 0.024302 0.005858 0.077843 -0.098929 0.044599 0.024113 0.098140 -0.054150
polarizability: 1.58501814e+02 4.79885145e-01 1.19500068e+02 -2.88882929e+00 -3.32227258e-01 1.02233658e+02
1716.lowfreq: -28.7047 -11.2550 0.0002 0.0003 0.0006 2.3384 32.4326 56.1354 67.1984
frequency: 32.0810 55.8186 67.1156 69.5404 85.6645 115.9698 146.9438 190.0267 194.0117 232.6255 242.4800 249.5041 291.0361 302.0965 322.4066 344.2115 374.5165 385.9754 430.2791 462.4715 476.7034 529.6222 610.2796 738.0373 756.1138 798.2460 814.7442 868.8446 881.1985 900.7119 918.0637 949.8144 957.4582 987.8528 1033.5796 1041.2848 1046.4148 1063.2848 1074.7647 1082.4483 1106.5595 1117.2708 1126.8485 1145.6485 1153.1036 1160.6452 1167.0135 1213.2729 1225.4124 1250.6305 1262.7691 1274.0304 1290.8185 1295.9616 1301.2504 1311.1883 1314.2054 1334.1327 1340.9410 1354.2694 1368.6823 1374.4249 1379.5762 1385.8614 1393.2484 1396.3497 1451.3302 1456.3326 1460.2801 1464.9066 1469.0206 1474.2125 1477.8726 1480.0307 1480.3384 1487.2809 1490.5830 2818.2749 2823.9869 2833.8253 2849.7594 2854.3427 2870.1775 2964.7786 2973.6518 2984.6129 2985.3690 3030.1535 3031.1149 3037.4821 3038.2143 3049.2224 3057.3169 3072.4264 3076.3731 3078.1179 3090.2569 3102.2755 3554.1509
redmass: 3.9662 1.6315 2.4626 3.5007 2.5790 2.6945 2.9354 1.5649 1.6290 1.1259 3.1717 2.1521 2.4516 1.7261 1.4898 2.4741 2.8330 2.7132 3.4441 3.2239 2.4384 3.6105 2.2530 2.9531 1.1382 1.1706 2.5772 2.1900 1.3809 1.4000 1.5820 1.7670 3.9274 2.3674 2.6743 2.0242 2.6066 1.8854 2.1287 2.8019 2.2510 1.8140 2.0644 2.1998 2.5304 1.8755 1.8354 1.6166 1.7126 1.2629 1.2826 1.2297 1.2013 1.1982 1.2298 1.4373 1.4111 1.2656 1.3141 1.3640 1.3853 1.3662 1.3727 1.2308 1.2433 1.4284 1.0791 1.0850 1.0881 1.0720 1.0916 1.0616 1.0560 1.0733 1.0580 1.0570 1.0798 1.0709 1.0724 1.0734 1.0750 1.0721 1.0695 1.0698 1.0355 1.0362 1.0601 1.0893 1.0937 1.0879 1.0871 1.0922 1.0876 1.1008 1.0992 1.0983 1.0994 1.0962 1.0661
irintensity: 0.5694 0.0423 1.7705 1.7955 3.7381 0.6503 1.2503 1.7808 0.8770 0.0616 1.4365 4.5642 2.3915 26.3481 115.2332 23.0367 0.6296 13.8775 0.8758 1.0368 1.4979 1.3329 2.0484 3.5925 7.0736 5.0549 15.1544 4.1023 3.9198 3.0143 9.5093 14.2031 103.0067 17.7214 38.7619 9.9877 0.4149 11.0392 2.4855 29.4764 5.1354 0.3927 21.6610 18.7220 23.1373 50.5199 12.0495 3.7744 4.8327 2.8940 17.8541 12.2658 8.1533 0.7443 12.4373 10.1703 6.8827 15.2234 45.1964 2.6602 9.0864 2.1940 9.9364 15.9599 10.0240 0.1382 1.0987 7.7343 3.1125 1.3460 3.7291 12.3132 2.4682 5.2225 17.5928 1.2809 19.8331 88.5761 73.5120 54.1356 44.5849 46.3122 265.7363 54.8838 43.3463 26.8031 22.7208 20.7297 8.1880 29.9285 52.7388 13.1388 36.3221 75.6117 81.4110 29.0629 34.1145 28.0268 7.6568
temp: 298.150 k
press: 1.00000 atm
elementType: 8 7 7 6 6 6 6 6 6 6 6 6 6 1 1 1 1 1 1 1 1 1 1 1 1 1 1 1 1 1 1 1 1 1 1
symmnumber: 1
zpe: 822650.5 jmol-1
zpe.correction: 0.313331 hartree
zpe.thermalcorrener: 0.328896 hartree
zpe.thermalcorrenthalpy: 0.329840 hartree
zpe.thermalcorrgfe: 0.270094 hartree
zpe.sumelectzpe: -577.853044 hartree
zpe.sumelectthermal: -577.837479 hartree
zpe.sumelectthermalent: -577.836535 hartree
zpe.sumelectthermalfe: -577.896281 hartree
dipole: -1.9185 0.7172 -1.1004
dipole: 2.3251
quadrupole: -94.7895 -78.9923 -83.0933
quadrupole: 4.4730 -9.4948 -0.0808
quadrupole: -9.1645 6.6327 2.5318 4.4730 -9.4948 -0.0808
hfenergy: -578.1663749 hartree
pointgroup: C01 [X(C10H22N2O1)]
dipole: -0.7529633 0.2786569 -0.4383815 debye
polarizability: 158.4874253|-0.0574404|119.4638128|-3.0828795|-0.7823956|102.2843017 unknown
InChI: InChI=1S/C10H22N2O/c1-3-4-12-6-5-11(7-8-13)9-10(12)2/h10,13H,3-9H2,1-2H3
charge 0 multiplicity 1
35 atoms
O  5.322272 -0.194859 0.089779
N  -1.344267 0.055564 -0.15862
N  1.525401 -0.424983 0.07648
C  -0.411046 1.168484 0.211995
C  0.987635 0.877185 -0.379161
C  -0.793125 -1.24712 0.302912
C  0.592196 -1.511615 -0.300748
C  -2.732726 0.268502 0.334504
C  -0.899668 2.536881 -0.307009
C  2.917867 -0.668505 -0.35874
C  -3.753146 -0.751933 -0.21655
C  3.941692 0.07367 0.525396
C  -5.203707 -0.339825 0.117912
H  -0.295948 1.218206 1.326643
H  0.906828 0.914649 -1.49749
H  1.673595 1.682533 -0.059854
H  -1.474698 -2.055159 -0.013379
H  -0.711174 -1.279485 1.419888
H  0.984919 -2.469658 0.088155
H  0.4882 -1.601897 -1.41196
H  -2.774767 0.260468 1.45706
H  -3.059251 1.271623 0.008579
H  -0.088463 3.282972 -0.219515
H  -1.190044 2.460255 -1.37078
H  -1.759639 2.924521 0.264817
H  3.078389 -0.381499 -1.433382
H  3.129844 -1.750947 -0.28323
H  -3.618292 -0.821054 -1.313234
H  -3.563684 -1.761127 0.196789
H  3.889084 -0.304312 1.557707
H  3.740193 1.165337 0.541182
H  -5.351439 -0.248574 1.210947
H  -5.455822 0.636032 -0.338272
H  -5.927528 -1.08534 -0.258114
H  5.42922 0.118308 -0.844407
