program: Gaussian 09
title: 000269722
version: EM64L-G09RevD.01
frameworkgroup: C1[X(C11H16N2O)]
method: RPBEPBE
basis: SDD
operation: Freq
keyword: #p
keyword: freq=noraman
keyword: PBEPBE/SDD
title: #p freq=noraman PBEPBE/SDD
converged: YES YES NO NO
title: Mulliken charges:
elementType: O N N C C C C C C C C C C C H H H H H H H H H H H H H H H H
charge: -0.271777 -0.187045 -0.296035 -0.342323 -0.352777 -0.409599 -0.428506 0.465999 -0.386929 -0.352574 -0.357871 -0.374417 0.317361 -0.537143 0.215953 0.202025 0.213974 0.207088 0.189445 0.209653 0.211765 0.189976 0.269434 0.217009 0.237879 0.233865 0.242921 0.240733 0.216106 0.215811
chargesum: 0.00000
title: Mulliken charges with hydrogens summed into heavy atoms:
elementType: O N N C C C C C C C C C C C
charge: -0.271777 -0.187045 -0.026601 0.075655 0.068285 -0.010501 -0.026764 0.465999 -0.169921 -0.114695 -0.124007 -0.131496 0.317361 0.135507
polarizability: 2.11143335e+02 2.02293258e+00 1.29563318e+02 -1.32451372e+00 -4.05276698e+00 8.18191816e+01
1716.lowfreq: -12.3996 0.0006 0.0008 0.0011 3.3566 9.9991 48.0363 52.8144 81.2573
frequency: 47.5032 52.6861 81.1674 115.5841 164.4334 217.1223 237.9947 246.0553 261.4275 279.7664 364.1277 385.2833 409.5573 416.9681 447.9123 453.0737 493.3597 525.4995 559.5289 633.8456 671.5427 687.1302 715.8930 771.5053 792.8987 813.6853 845.4811 864.4711 911.3796 931.2757 934.8447 940.0867 986.3076 1000.5523 1044.1113 1051.7470 1072.0460 1097.0344 1111.6447 1117.1304 1145.6891 1158.0829 1167.4449 1181.2958 1202.1402 1225.8371 1234.2297 1244.3564 1285.4914 1307.9371 1324.4225 1337.4185 1351.9820 1367.5878 1374.8361 1389.3299 1427.1327 1436.7794 1445.3421 1455.3155 1455.9966 1462.0225 1464.4204 1468.1015 1474.8746 1507.1634 1573.9234 1632.2950 2869.3245 2874.6299 2902.1577 2915.0940 2948.3569 3031.3210 3038.5729 3042.9895 3049.1960 3083.1037 3116.0951 3135.8501 3145.8768 3158.2746 3168.1319 3457.4953
redmass: 3.9974 3.0731 3.3680 4.0823 3.5879 2.0339 2.1650 1.9358 1.9847 3.3943 2.7096 2.9882 3.3649 3.2162 3.6795 2.9248 2.1912 2.4014 2.7741 6.7715 3.5249 1.6224 3.6322 4.5842 1.3849 1.6666 1.5225 3.2331 1.4408 1.9854 2.4490 1.5474 4.8897 3.4089 2.3608 1.7540 1.7775 2.2344 1.2611 1.4796 2.0888 1.3437 3.5178 1.3254 1.1006 1.9679 1.8234 1.5095 1.2907 1.3186 1.2590 1.3527 1.8838 2.8001 1.9831 1.4298 3.2825 1.2217 1.3525 1.0777 1.0854 1.1042 1.0509 1.1099 1.0725 2.4639 7.1020 6.4762 1.0712 1.0694 1.0686 1.0704 1.0334 1.1035 1.0900 1.0912 1.0905 1.0897 1.0985 1.0864 1.0870 1.0953 1.0961 1.0754
irintensity: 1.3729 2.3481 2.3310 2.9442 2.1750 10.0228 0.8263 1.3806 10.5165 0.6411 1.6509 3.5674 5.1712 0.9495 17.2087 4.0104 47.1597 24.9908 22.0480 0.8689 54.1201 62.2249 1.3563 13.4062 8.9250 77.6360 2.8985 2.5370 1.2816 6.9286 32.2644 4.3178 20.6068 65.2610 15.5637 1.3337 2.9838 16.6764 0.2847 6.0080 26.0823 3.2478 19.3067 55.9921 2.9289 321.5984 15.1075 19.8416 5.9497 3.9183 32.2468 6.0434 3.8884 13.2696 27.8926 1.1685 5.9382 18.8531 2.1917 5.4253 2.7413 63.9472 11.6778 5.1621 64.5499 320.9284 0.4266 5.8730 69.3285 107.2338 72.0593 122.6358 80.9788 57.7939 52.0069 60.6452 26.8165 21.7650 32.4446 18.4767 13.1877 23.4542 5.8482 1.8119
temp: 298.150 k
press: 1.00000 atm
elementType: 8 7 7 6 6 6 6 6 6 6 6 6 6 6 1 1 1 1 1 1 1 1 1 1 1 1 1 1 1 1
symmnumber: 1
zpe: 668662.1 jmol-1
zpe.correction: 0.254680 hartree
zpe.thermalcorrener: 0.267703 hartree
zpe.thermalcorrenthalpy: 0.268647 hartree
zpe.thermalcorrgfe: 0.215006 hartree
zpe.sumelectzpe: -612.388703 hartree
zpe.sumelectthermal: -612.375680 hartree
zpe.sumelectthermalent: -612.374736 hartree
zpe.sumelectthermalfe: -612.428377 hartree
dipole: 1.5285 -1.7417 0.7548
dipole: 2.4371
quadrupole: -69.6825 -76.5090 -89.2793
quadrupole: 7.0107 2.3229 -0.3901
quadrupole: 8.8078 1.9812 -10.7890 7.0107 2.3229 -0.3901
hfenergy: -612.6433829 hartree
pointgroup: C01 [X(C11H16N2O1)]
dipole: -0.6099815 0.6901338 0.2664808 debye
polarizability: 211.0678112|2.7851491|129.8390908|2.3616497|2.3402157|81.6189322 unknown
InChI: InChI=1S/C11H16N2O/c1-14-11-4-2-10(3-5-11)13-8-6-12-7-9-13/h2-5,12H,6-9H2,1H3
charge 0 multiplicity 1
30 atoms
O  4.19771 -0.389383 0.027173
N  -1.488286 0.03609 0.103001
N  -4.342021 0.11238 -0.164155
C  -2.16382 1.153092 -0.604574
C  -2.273749 -1.215329 0.081368
C  -3.581843 1.375984 -0.05036
C  -3.699739 -0.968982 0.611955
C  -0.066702 -0.046667 0.050891
C  0.739972 1.11269 0.23325
C  0.612493 -1.289411 -0.140542
C  2.149223 1.046044 0.224583
C  2.017539 -1.364513 -0.133106
C  2.798779 -0.200048 0.045451
C  5.031274 0.797021 0.207993
H  -2.241697 0.929006 -1.693807
H  -1.57738 2.077924 -0.488806
H  -1.784089 -1.958029 0.735482
H  -2.337867 -1.64075 -0.948043
H  -3.495812 1.733962 1.005842
H  -4.08607 2.158858 -0.645921
H  -4.289662 -1.897256 0.500874
H  -3.624773 -0.727979 1.7016
H  -5.339807 0.223336 0.055994
H  0.268405 2.083911 0.415509
H  0.047095 -2.208907 -0.31744
H  2.721834 1.966883 0.374115
H  2.527974 -2.321556 -0.281612
H  6.068651 0.433409 0.155978
H  4.85376 1.272616 1.193597
H  4.858305 1.542005 -0.594688
