program: Gaussian 09
title: 000269719
version: EM64L-G09RevD.01
frameworkgroup: C1[X(C11H24N2S2)]
method: RPBEPBE
basis: SDD
operation: Freq
keyword: #p
keyword: freq=noraman
keyword: PBEPBE/SDD
title: #p freq=noraman PBEPBE/SDD
converged: YES YES NO NO
title: Mulliken charges:
elementType: S S N N C C C C C C C C C C C H H H H H H H H H H H H H H H H H H H H H H H H
charge: 0.143276 0.160033 -0.088269 -0.044957 0.005142 -0.383948 -0.357949 -0.353013 -0.760323 -0.665725 -0.610128 -0.602899 -0.643081 -0.629059 -0.618300 0.211861 0.201842 0.186282 0.203440 0.228532 0.191068 0.227763 0.220887 0.228434 0.220277 0.247423 0.266070 0.230910 0.250126 0.242184 0.265461 0.253561 0.246384 0.219859 0.231596 0.210430 0.220289 0.231568 0.212953
chargesum: 0.00000
title: Mulliken charges with hydrogens summed into heavy atoms:
elementType: S S N N C C C C C C C C C C C
charge: 0.143276 0.160033 -0.088269 -0.044957 0.217004 0.004176 0.074023 0.065818 -0.090725 -0.152231 -0.129093 -0.095254 -0.143137 0.032827 0.046511
polarizability: 2.13741623e+02 -5.10655874e+00 1.58778207e+02 -7.85048142e+00 -1.22842787e+00 1.45506868e+02
1716.lowfreq: -27.7758 -0.0030 0.0015 0.0015 0.8732 7.3819 17.7485 29.6095 39.2828
frequency: -25.4628 29.2976 38.5754 46.4488 60.3328 76.0027 94.1016 106.0880 150.2665 156.0849 185.9966 215.9885 221.0989 222.6845 248.6077 266.1706 288.7791 293.4575 319.7318 327.7741 337.7766 353.8626 416.5391 439.2100 456.2318 494.1183 592.8187 609.4237 611.5011 652.7355 672.0767 722.8602 754.4359 758.0888 798.5836 862.9235 896.6942 910.8018 924.9804 952.6167 980.7224 981.4989 1007.8997 1036.9739 1044.3686 1052.0693 1059.6684 1061.6333 1068.3309 1088.2852 1119.9552 1138.8277 1144.7678 1165.8421 1177.8306 1204.9971 1238.5256 1241.5941 1253.2766 1261.2923 1264.1309 1269.0909 1277.4612 1281.8710 1292.3970 1313.8840 1321.0498 1344.1107 1357.6634 1376.8236 1381.3882 1389.5530 1390.2154 1392.7042 1445.4106 1447.9320 1449.1127 1452.9594 1458.9520 1460.7994 1465.8158 1468.4776 1471.5063 1474.5457 1477.0919 1479.3877 1493.2222 2851.4483 2868.3402 2877.1544 2894.4021 2900.5244 2932.7933 2973.6431 2973.7531 2983.8895 3007.4350 3015.8220 3028.8821 3037.4379 3043.7798 3061.1933 3061.7412 3066.3757 3074.8664 3075.2810 3077.6769 3084.7199 3098.3760 3098.8952 3114.5454
redmass: 3.8899 3.8143 3.6904 3.6762 2.9143 2.7494 4.4881 2.3592 2.1088 2.9901 2.0454 1.8441 1.8171 1.7691 1.3626 1.8402 2.0805 2.5277 2.4473 2.9647 2.4198 2.3025 3.4549 3.4563 2.9183 2.9934 2.3708 4.8564 4.3962 5.2272 4.6741 3.3903 1.2097 1.1765 2.7986 1.9012 1.5602 1.4220 1.7548 1.6676 1.7204 1.7559 2.0031 1.4085 1.7370 1.5136 2.3007 2.2702 1.7184 2.9308 1.9681 1.9091 2.1475 1.9470 1.9745 1.1684 1.3098 1.1990 1.2340 1.2178 1.3011 1.4305 1.3626 1.2083 1.4595 1.4767 1.6282 1.2892 1.3886 1.4232 1.5216 1.2113 1.2112 1.2221 1.0840 1.0834 1.0842 1.0929 1.0800 1.0781 1.0810 1.0474 1.0669 1.0576 1.0526 1.0522 1.0503 1.0698 1.0699 1.0812 1.0690 1.0688 1.0704 1.0366 1.0369 1.0363 1.0608 1.0605 1.0893 1.0903 1.0901 1.0986 1.0977 1.0931 1.0997 1.0997 1.0985 1.0999 1.1029 1.1033 1.0911
irintensity: 0.7094 0.1722 0.4879 0.0602 2.3555 0.5627 1.3729 5.3215 0.3463 1.8774 2.4695 3.0678 0.5479 2.7216 0.3396 6.6653 0.6077 8.4755 0.9668 1.7022 4.3324 2.4432 8.1562 3.4918 0.8321 1.4902 1.0193 2.2734 2.4330 8.7829 79.7709 4.1465 5.3378 18.4101 11.4336 9.0651 1.5290 3.4043 8.4192 26.9245 22.5121 19.2177 2.6779 15.2205 20.4119 29.2290 3.8145 1.7395 2.9142 47.9946 45.0701 5.4258 48.0620 211.9879 16.1702 2.6625 29.4248 10.8688 0.6423 32.3798 14.7209 2.1785 6.2736 17.7550 32.2998 49.8363 22.0358 1.5689 2.2247 5.6177 1.1866 9.3882 17.6574 30.4148 1.8911 10.3114 4.3093 4.2076 13.9672 2.5385 6.2109 11.2403 10.6687 22.8399 4.1586 0.5324 23.7364 67.6363 34.9309 79.3231 90.3986 139.9018 81.3312 32.9262 35.1589 26.1930 18.7619 28.6028 32.4328 18.6427 14.4504 46.9153 37.6370 22.5118 10.1654 9.9803 46.4930 28.8421 32.4430 38.1888 16.2778
temp: 298.150 k
press: 1.00000 atm
elementType: 16 16 7 7 6 6 6 6 6 6 6 6 6 6 6 1 1 1 1 1 1 1 1 1 1 1 1 1 1 1 1 1 1 1 1 1 1 1 1
symmnumber: 1
zpe: 889989.7 jmol-1
zpe.correction: 0.338979 hartree
zpe.thermalcorrener: 0.357357 hartree
zpe.thermalcorrenthalpy: 0.358301 hartree
zpe.thermalcorrgfe: 0.291333 hartree
zpe.sumelectzpe: -1337.911863 hartree
zpe.sumelectthermal: -1337.893485 hartree
zpe.sumelectthermalent: -1337.892541 hartree
zpe.sumelectthermalfe: -1337.959509 hartree
dipole: 0.4143 1.2833 2.5867
dipole: 2.9171
quadrupole: -114.1444 -108.7232 -108.0295
quadrupole: -11.6643 3.8428 -0.8791
quadrupole: -3.8454 1.5758 2.2695 -11.6643 3.8428 -0.8791
hfenergy: -1338.2508417 hartree
pointgroup: C01 [X(C11H24N2S2)]
dipole: 0.174184 -0.5725269 -0.9793103 debye
polarizability: 213.38116|2.3223698|158.1209879|10.5288645|-2.3420411|146.5245496 unknown
InChI: InChI=1S/C11H24N2S2/c1-4-14-9-12-6-7-13(10-15-5-2)11(3)8-12/h11H,4-10H2,1-3H3
charge 0 multiplicity 1
39 atoms
S  -3.410063 1.79588 0.348812
S  4.087797 -0.641226 0.764894
N  -1.343786 -0.122315 0.489919
N  1.401641 -0.7854 -0.002537
C  -0.933699 -1.559946 0.437576
C  0.319032 -1.673107 -0.465886
C  -0.250481 0.75952 0.969192
C  0.992601 0.627375 0.081483
C  -2.040366 -2.480804 -0.113712
C  -2.631828 0.199121 1.085676
C  2.720466 -1.026349 -0.543835
C  -3.498019 1.250713 -1.462527
C  5.326184 0.297578 -0.327842
C  -4.716506 0.369613 -1.778106
C  4.929857 1.760168 -0.579953
H  -0.634297 -1.911684 1.456348
H  0.682681 -2.717437 -0.437366
H  0.003461 -1.441503 -1.515189
H  0.029282 0.512523 2.021868
H  -0.622084 1.799886 0.939262
H  0.76797 1.047211 -0.930733
H  1.827812 1.201529 0.523216
H  -2.861823 -2.63894 0.60622
H  -2.463586 -2.064349 -1.046443
H  -1.61486 -3.475208 -0.341277
H  -2.59227 0.435953 2.171686
H  -3.349935 -0.615904 0.924316
H  2.98466 -0.398266 -1.42628
H  2.819501 -2.089656 -0.816661
H  -3.51104 2.189001 -2.042966
H  -2.542867 0.72843 -1.654991
H  6.282317 0.227487 0.218988
H  5.438733 -0.267018 -1.270564
H  -4.704898 -0.559732 -1.179463
H  -5.659276 0.90036 -1.558524
H  -4.721265 0.081679 -2.847998
H  3.953862 1.829284 -1.094536
H  4.850262 2.313735 0.371788
H  5.683331 2.2664 -1.214856
