program: Gaussian 09
title: 000269710
version: EM64L-G09RevD.01
frameworkgroup: C1[X(C15H21N3)]
method: RPBEPBE
basis: SDD
operation: Freq
keyword: #pfreq=noraman
keyword: PBEPBE/SDD
title: #p freq=noraman PBEPBE/SDD
converged: YES YES NO NO
title: Mulliken charges:
elementType: N N N C C C C C C C C C C C C C C C H H H H H H H H H H H H H H H H H H H H H
charge: -0.115930 -0.168218 -0.014322 -0.364584 -0.381594 0.315976 -0.394246 -0.411097 0.463569 -0.727700 -0.725751 -0.224602 -0.380972 -0.369960 -0.366605 -0.438958 0.448485 -0.812312 0.217958 0.209981 0.212512 0.218094 0.211789 0.209713 0.220934 0.203954 0.232503 0.228461 0.237041 0.231358 0.228369 0.237034 0.216984 0.232045 0.223156 0.223074 0.224780 0.227753 0.221327
chargesum: 0.00000
title: Mulliken charges with hydrogens summed into heavy atoms:
elementType: N N N C C C C C C C C C C C C C C C
charge: -0.115930 -0.168218 -0.014322 0.063355 0.049012 0.315976 0.027256 0.013791 0.463569 -0.029695 -0.028990 -0.224602 -0.163987 -0.137915 -0.143449 -0.215884 0.448485 -0.138452
polarizability: 2.64560519e+02 4.32568843e-01 1.61654960e+02 -2.42361996e+00 -4.07755406e+00 1.28399331e+02
1716.lowfreq: -29.4391 -10.3231 -1.4337 -0.0008 -0.0008 -0.0003 12.4814 25.6080 37.0765
frequency: -28.5999 25.3197 37.0508 65.9270 77.5489 91.0489 131.7394 156.2564 169.6220 186.1783 211.2792 228.7866 251.7411 262.7606 273.1904 317.5985 339.3117 364.1481 392.3554 396.1138 408.3886 412.9639 443.6030 446.8851 470.9462 519.9131 559.2469 564.5696 616.1400 637.3656 676.3785 691.7919 713.8107 733.3913 792.2453 808.5293 817.5722 846.2414 899.3239 925.2525 928.3229 941.1476 954.9869 959.2293 973.5838 981.5431 1002.8920 1008.1582 1045.1132 1048.5000 1055.6586 1083.5202 1104.2122 1129.4688 1134.3910 1165.1512 1166.8344 1200.1313 1200.4918 1202.1019 1224.4537 1227.5835 1241.5967 1280.3900 1304.3856 1316.1076 1344.4416 1349.4756 1356.5043 1371.0497 1376.3441 1377.1299 1386.8137 1395.7516 1396.2721 1421.4713 1450.4453 1459.2118 1462.3955 1463.9378 1469.1088 1470.0581 1475.4524 1477.2087 1477.9548 1500.3474 1515.9807 1572.8154 1631.8756 2154.8502 2891.6788 2900.1521 2906.8335 2915.1722 2969.3486 2999.4783 3002.1469 3044.8703 3051.2683 3073.9796 3076.9215 3077.0304 3087.2420 3100.6562 3107.9080 3108.3085 3111.1391 3112.5859 3116.6394 3147.8092 3157.7492
redmass: 1.0327 4.8258 3.9190 3.3250 3.7090 5.0215 4.2389 2.9222 3.8022 1.5190 2.7735 2.1432 1.4789 1.8613 2.1160 2.7340 3.1217 2.4291 2.3226 3.4282 3.1232 3.3250 3.4307 3.3631 2.7574 2.5772 3.8203 4.9738 4.1893 6.7733 4.0507 2.6991 2.8572 2.8284 4.3481 1.6039 1.3684 1.5690 3.3267 2.1846 1.5531 1.4573 1.3743 2.0704 2.4030 1.4345 2.7597 1.3602 1.5208 2.3173 1.8713 2.3203 2.0474 1.6585 3.0715 2.1430 3.1492 1.2576 2.0018 1.3776 2.5002 2.7791 1.5524 1.3590 1.3554 1.3274 1.6349 1.2695 1.9784 2.1177 1.4408 1.3644 1.4432 1.1886 1.2374 3.4342 1.0640 1.0842 1.0650 1.0897 1.0465 1.0961 1.1035 1.0495 1.0688 1.0536 2.7299 5.7899 6.3578 12.6788 1.0707 1.0711 1.0696 1.0698 1.0372 1.0350 1.0357 1.0976 1.0905 1.0893 1.0975 1.0919 1.0884 1.1003 1.0998 1.1002 1.0999 1.0883 1.0888 1.0938 1.0937
irintensity: 0.3993 0.8441 1.7081 1.4919 1.5003 0.6918 2.2457 2.1862 0.9590 0.7487 3.7949 1.0670 1.4116 2.7642 7.4857 8.5571 7.2608 1.6342 0.0370 0.1603 0.8847 0.6678 0.4575 3.1431 1.1754 19.8607 8.9518 1.1176 6.1037 0.1711 0.5826 8.2684 1.8793 11.8979 0.9820 58.8396 5.1415 2.3220 0.7997 29.4591 10.2332 1.3973 0.9677 1.7647 62.8998 3.8478 1.1270 0.9755 10.3205 10.0553 0.6577 1.1830 11.8626 12.8357 4.9017 135.2803 33.2011 18.8983 33.1820 4.2960 0.0443 16.5614 128.3384 42.1317 14.4481 0.2501 0.3198 5.3291 30.8535 10.4598 22.5593 13.8770 14.1152 18.0698 21.8575 4.9361 6.2771 6.6148 2.2072 43.6760 11.8683 29.8077 11.4985 3.1193 4.4569 37.7359 193.5083 11.8347 75.0530 5.2535 56.5373 23.5574 23.9380 138.1313 63.6145 13.5590 12.8861 25.5505 22.8753 27.3011 18.7700 38.6609 15.5857 6.3563 34.4291 28.3781 19.3082 16.6361 34.0031 28.6749 11.7854
temp: 298.150 k
press: 1.00000 atm
elementType: 7 7 7 6 6 6 6 6 6 6 6 6 6 6 6 6 6 6 1 1 1 1 1 1 1 1 1 1 1 1 1 1 1 1 1 1 1 1 1
symmnumber: 1
zpe: 868239.5 jmol-1
zpe.correction: 0.330695 hartree
zpe.thermalcorrener: 0.348254 hartree
zpe.thermalcorrenthalpy: 0.349198 hartree
zpe.thermalcorrgfe: 0.285024 hartree
zpe.sumelectzpe: -747.057687 hartree
zpe.sumelectthermal: -747.040129 hartree
zpe.sumelectthermalent: -747.039184 hartree
zpe.sumelectthermalfe: -747.103358 hartree
dipole: 0.1839 1.0939 -3.5281
dipole: 3.6984
quadrupole: -107.5612 -100.1580 -121.9075
quadrupole: 5.6456 -15.7222 4.7083
quadrupole: 2.3144 9.7175 -12.0319 5.6456 -15.7222 4.7083
hfenergy: -747.3883821 hartree
pointgroup: C01 [X(C15H21N3)]
dipole: -0.0554376 0.9591829 1.0927393 debye
polarizability: 264.4871202|-2.7774187|159.226209|-2.7197277|-9.6050917|130.901481 unknown
InChI: InChI=1S/C15H21N3/c1-13-4-6-14(7-5-13)17-8-10-18(11-9-17)15(2,3)12-16/h4-7H,8-11H2,1-3H3
charge 0 multiplicity 1
39 atoms
N  -2.367969 0.379313 0.364414
N  0.512588 0.068236 0.051304
N  -4.332087 -1.570202 -1.759149
C  -1.671051 -0.859924 0.816786
C  -1.650045 0.918884 -0.82572
C  -3.852415 0.236607 0.190197
C  -0.213607 -0.540117 1.187186
C  -0.185758 1.249539 -0.48192
C  1.934403 0.033261 0.032315
C  -4.486832 1.60119 -0.201584
C  -4.509571 -0.243615 1.514724
C  -4.166507 -0.7652 -0.891811
C  2.639126 -1.147576 0.416988
C  2.712206 1.143264 -0.407564
C  4.043084 -1.205941 0.359902
C  4.121328 1.062819 -0.470681
C  4.82169 -0.105209 -0.088413
C  6.336921 -0.189636 -0.158008
H  -1.687494 -1.646218 0.024683
H  -2.169425 -1.257989 1.715168
H  -2.134729 1.850234 -1.159539
H  -1.667643 0.189732 -1.67063
H  -0.212592 0.151836 2.061769
H  0.283137 -1.472733 1.496659
H  0.311857 1.576357 -1.411583
H  -0.164917 2.099867 0.240793
H  -4.21103 1.926264 -1.217519
H  -5.586462 1.523606 -0.166516
H  -4.156637 2.364514 0.524553
H  -4.246082 -1.282038 1.771749
H  -5.607685 -0.193773 1.424946
H  -4.184101 0.424827 2.330842
H  2.086796 -2.038896 0.732616
H  2.229935 2.085175 -0.68508
H  4.546774 -2.134971 0.657003
H  4.685686 1.938801 -0.814837
H  6.775191 -0.459433 0.821661
H  6.668036 -0.957767 -0.883431
H  6.779086 0.773213 -0.468474
