program: Gaussian 09
title: 000269697
version: EM64L-G09RevD.01
frameworkgroup: C1[X(C11H11NO2)]
method: RPBEPBE
basis: SDD
operation: Freq
keyword: #p
keyword: freq=noraman
keyword: PBEPBE/SDD
title: #p freq=noraman PBEPBE/SDD
converged: YES YES NO NO
title: Mulliken charges:
elementType: O O N C C C C C C C C C C C H H H H H H H H H H H
charge: -0.467864 -0.231949 -0.449880 0.288403 0.227785 0.516186 -0.610240 -0.485520 -0.544067 -0.358272 0.275023 -0.366604 -0.675285 0.075043 0.249807 0.282313 0.208166 0.211421 0.338041 0.235723 0.232148 0.224523 0.217013 0.220348 0.387740
chargesum: 0.00000
title: Mulliken charges with hydrogens summed into heavy atoms:
elementType: O O N C C C C C C C C C C C
charge: -0.080124 -0.231949 -0.111839 0.288403 0.227785 0.516186 -0.360434 -0.203207 -0.124480 -0.122549 0.275023 -0.134456 -0.013401 0.075043
polarizability: 2.40302018e+02 -7.66656859e+00 1.29109318e+02 6.34172457e+00 2.67712841e+00 6.48460485e+01
1716.lowfreq: -7.0467 -3.0631 -0.0007 -0.0004 0.0003 9.5831 39.9293 63.7739 91.6183
frequency: 39.9146 63.7736 91.6098 122.9359 134.4323 205.5572 239.8085 264.6131 287.3873 332.7235 394.0973 404.6526 434.3306 508.6494 528.2124 536.7884 599.0216 606.1521 615.5790 637.5588 652.2832 719.7085 733.4436 763.8362 785.5843 814.9737 817.6900 847.5542 904.3322 921.0389 932.0399 951.4738 976.1485 1021.4743 1056.1145 1067.4590 1123.2153 1144.1474 1165.2350 1215.3879 1237.2781 1243.2506 1275.7852 1310.1654 1316.4289 1335.3707 1388.5846 1390.6317 1419.5237 1457.1733 1472.4682 1474.2757 1481.8661 1490.7383 1545.0079 1581.6029 1638.6588 1669.5292 2979.1300 2981.6493 3034.7159 3077.1984 3083.4239 3121.0024 3132.4095 3149.2097 3230.8201 3549.0927 3606.2414
redmass: 2.7763 4.6275 7.5873 5.0650 4.1831 1.2671 3.8665 4.5700 2.5208 5.5867 3.6196 4.8409 2.8955 4.2905 4.9887 1.4712 4.1724 1.9653 1.3773 2.9660 5.0731 4.8512 4.6376 3.8571 1.2239 1.5817 3.1193 1.4210 1.5586 3.6184 6.9528 1.3447 2.0654 2.9106 1.8016 1.7027 1.3213 1.3913 1.8465 1.5871 1.8741 1.3191 1.9775 1.4939 1.8744 3.6085 2.4612 1.6978 2.9387 4.0554 1.0668 1.0640 2.6513 1.3622 6.0790 5.6921 7.5294 8.7669 1.0382 1.0578 1.1003 1.0999 1.1011 1.0876 1.0921 1.0968 1.0985 1.0646 1.0809
irintensity: 0.0725 1.7225 0.0198 0.2871 0.1525 0.1778 0.1377 0.0749 1.0988 5.6714 0.4421 3.0266 2.6044 11.1031 19.8858 116.9855 24.3067 106.5154 8.5931 14.0027 4.8733 50.6884 4.5927 1.5273 3.7306 38.2614 2.9705 27.9995 31.9048 15.2003 102.9708 1.3585 24.2249 220.7553 5.2456 8.8242 199.5428 3.7014 22.7582 2.4705 12.2655 5.7199 42.0742 2.7813 11.7048 62.9224 37.5509 15.4419 1.9907 33.4751 8.2618 4.6765 13.0856 4.7860 88.0282 1.6340 0.1139 607.1227 43.8676 39.5390 8.4172 65.6904 39.0808 8.2540 15.5269 17.6795 0.2123 61.8367 101.9958
temp: 298.150 k
press: 1.00000 atm
elementType: 8 8 7 6 6 6 6 6 6 6 6 6 6 6 1 1 1 1 1 1 1 1 1 1 1
symmnumber: 1
zpe: 516393.0 jmol-1
zpe.correction: 0.196684 hartree
zpe.thermalcorrener: 0.209019 hartree
zpe.thermalcorrenthalpy: 0.209963 hartree
zpe.thermalcorrgfe: 0.157507 hartree
zpe.sumelectzpe: -629.999313 hartree
zpe.sumelectthermal: -629.986978 hartree
zpe.sumelectthermalent: -629.986033 hartree
zpe.sumelectthermalfe: -630.038490 hartree
dipole: -1.5342 2.6740 0.1213
dipole: 3.0853
quadrupole: -74.8155 -76.3353 -85.9080
quadrupole: 11.5333 1.4952 0.8846
quadrupole: 4.2041 2.6843 -6.8884 11.5333 1.4952 0.8846
hfenergy: -630.1959968 hartree
pointgroup: C01 [X(C11H11N1O2)]
dipole: -0.6271184 1.0274015 0.1567979 debye
dipolederiv: -0.8560943 -0.3887688 -0.0773379 -0.7957411 -0.9661016 -0.1203062 -0.1502736 -0.1042748 -0.4730556 -1.2541615 0.3148834 0.0060956 0.5507296 -0.835285 -0.0545365 0.0323904 -0.0613916 -0.337122 -0.3261496 -0.0233427 0.0045256 -0.3507925 -0.4923224 -0.0542573 -0.0600535 -0.0377513 -0.2605979 -0.1793596 0.1011266 0.0115691 -0.0011851 -0.1581333 -0.0251892 -0.0081503 -0.0211684 0.0186517 0.2449092 0.137356 0.0288774 0.1219686 -0.0405043 -0.0079023 0.032489 -0.0064178 0.0441281 0.2242441 0.1346163 0.0046083 0.4048088 -0.1407596 -0.0111639 0.0480679 -0.0071586 -0.0977242 0.1635887 -0.1214678 0.0120278 0.0678766 0.1057918 0.0493304 0.0290373 0.0289235 -0.1598506 0.4494006 -0.2245795 -0.0046006 0.1249705 -0.0258367 0.0353008 0.055282 0.0146311 -0.1976576 0.0499529 -0.01882 0.034426 0.0263151 0.1461467 -0.0012374 0.16186 0.0117857 0.1033899 0.0297166 -0.1514416 -0.0068962 -0.0768853 0.0970593 0.0344498 0.0076567 0.0350779 -0.1795121 -1.5098684 0.0204179 -0.0649498 -0.1331145 0.4295133 0.0632396 -0.1076435 0.0660763 0.017518 -0.2357601 0.0455823 0.0135708 -0.2284647 0.1494384 0.0438975 -0.048129 0.0546613 -0.1548652 -0.0393008 -0.0150985 0.0454428 -0.0381542 0.0737382 0.0025107 -0.0546659 -0.010379 -0.0011409 2.7328899 -0.0051336 0.1188636 0.048779 1.4109583 0.188623 0.1521562 0.1844448 0.2802208 0.0693115 -0.0321977 -0.0156067 -0.0669566 -0.0749746 -0.0383615 -0.0187582 -0.0369731 0.1403429 0.0878848 0.0215486 -0.0025892 0.0357133 0.0247276 -0.0238051 0.0002653 -0.0243356 0.1844649 -0.0686703 0.0270202 -0.0665417 0.0752142 -0.0074099 0.1226276 -0.0724119 0.0724052 -0.0368969 0.0271842 0.0322592 0.0350432 -0.0692552 -0.1127916 -0.1172244 0.0041655 -0.0777344 0.0086342 0.2439892 0.0342896 -0.0007742 0.0637876 0.2403105 -0.013798 0.0046016 -0.0140737 0.3355873 0.0614003 -0.054052 -0.0127964 -0.0068507 -0.0931731 -0.0377055 -0.009271 -0.0415198 0.1675352 -0.0610715 0.1123213 0.0013887 0.1027678 0.0260733 -0.0181422 -0.00077 -0.0170527 0.1389636 0.0615172 0.0972466 -0.0809565 0.0595423 -0.0059969 0.1088457 -0.0334256 0.0752598 -0.0285707 -0.2627714 -0.0972218 0.0136434 -0.1168608 0.0748726 0.0000877 0.0232401 -0.0042212 0.062744 0.1244435 -0.021418 0.0026204 0.0190304 -0.1149457 -0.1163941 -0.0065376 -0.0649367 0.0214767 0.2227749 0.074874 0.0003464 0.1827566 0.2896049 -0.0088889 0.0188781 -0.013877 0.4033364 unknown
polarizability: 240.7400937|-5.3824018|127.6543345|3.2871673|9.0195612|65.8629561 unknown
InChI: InChI=1S/C11H11NO2/c1-2-7-3-4-9-8(5-7)6-10(12-9)11(13)14/h3-6,12-13H,2H2,1H3
charge 0 multiplicity 1
25 atoms
O  4.125316 0.98565 0.27893
O  4.232173 -1.324322 -0.079236
N  1.426851 1.055458 0.131712
C  -0.158589 -0.55979 -0.21068
C  0.054898 0.851326 0.02263
C  -2.572037 -0.152162 -0.286337
C  -1.488197 -1.045145 -0.365875
C  1.135979 -1.185531 -0.236642
C  -4.009383 -0.641491 -0.408605
C  -1.02445 1.76248 0.100214
C  2.087929 -0.17622 -0.023259
C  -2.320678 1.243578 -0.054367
C  -4.735959 -0.704901 0.961932
C  3.539436 -0.286205 0.043642
H  -1.667253 -2.111395 -0.547255
H  1.370045 -2.23724 -0.38904
H  -4.57883 0.027151 -1.084151
H  -4.024876 -1.645788 -0.872513
H  1.914904 1.933981 0.297566
H  -0.862418 2.832316 0.269278
H  -3.176514 1.92818 -0.003571
H  -4.220869 -1.402204 1.646845
H  -5.780535 -1.046048 0.84083
H  -4.754399 0.288099 1.44692
H  5.112255 0.880526 0.319333
