program: Gaussian 09
title: 000269712
version: EM64L-G09RevD.01
frameworkgroup: C1[X(C13H17ClN2O2)]
method: RPBEPBE
basis: SDD
operation: Freq
keyword: #p
keyword: freq=noraman
keyword: PBEPBE/SDD
title: #p freq=noraman PBEPBE/SDD
converged: NO YES NO NO
title: Mulliken charges:
elementType: Cl O O N N C C C C C C C C C C C C C H H H H H H H H H H H H H H H H H
charge: -0.083826 -0.414987 -0.234761 -0.081367 -0.177779 -0.344288 -0.377027 -0.389673 -0.401861 -0.332746 0.495618 -0.494954 -0.310027 -0.393762 0.180259 -0.102377 -0.206735 -0.295337 0.205518 0.189862 0.190676 0.218508 0.207047 0.220401 0.216053 0.220062 0.193452 0.241197 0.252235 0.267664 0.261675 0.221384 0.225570 0.255761 0.378566
chargesum: 0.00000
title: Mulliken charges with hydrogens summed into heavy atoms:
elementType: Cl O O N N C C C C C C C C C C C C C
charge: -0.083826 -0.036421 -0.234761 -0.081367 -0.177779 0.051092 0.032156 0.037776 0.034254 0.101903 0.495618 0.024944 -0.048352 -0.172379 0.180259 -0.102377 0.018835 -0.039575
polarizability: 2.58846014e+02 3.01577263e+00 1.65295444e+02 1.48585586e+00 6.84424277e-01 9.96197541e+01
1716.lowfreq: -3.0497 0.0014 0.0016 0.0020 2.9089 6.3393 20.0514 22.3636 45.9567
frequency: 19.8988 22.3496 45.8874 47.4595 65.3821 85.3528 111.7864 159.5076 166.5482 179.2894 224.2022 232.4962 267.3555 284.5715 306.3945 354.1634 382.9618 392.1264 438.1126 452.5955 461.9991 488.7756 518.7829 520.3801 566.5333 591.5397 629.1124 648.1799 663.1746 678.7699 753.0390 762.7290 777.5321 788.0751 834.9795 847.9359 861.3695 882.0445 937.2477 953.6061 959.6875 969.7892 1001.4895 1036.0755 1049.9995 1056.6527 1065.2553 1077.9765 1092.3264 1094.7420 1097.8472 1140.1433 1152.4733 1176.3267 1182.8193 1201.3562 1216.3760 1241.8843 1248.0532 1264.8892 1288.1986 1300.7835 1305.8602 1328.5532 1347.1306 1348.8733 1356.3948 1373.9984 1377.4498 1385.9892 1404.0067 1434.5221 1441.6598 1456.9553 1457.1929 1461.3634 1467.1266 1480.4640 1485.3012 1559.0989 1615.5738 1666.2223 2855.6101 2860.1171 2875.9396 2918.1168 2928.8526 3002.4584 3038.3178 3044.9206 3047.6089 3057.8234 3072.4922 3093.1464 3136.6869 3165.2582 3183.2942 3187.0195 3511.0999
redmass: 7.6607 8.4690 3.3933 4.9119 3.7861 2.8996 5.0684 6.2691 4.0336 5.1105 2.5622 2.7974 3.1938 3.4447 3.0272 5.8866 6.6703 2.1218 3.0964 3.3973 3.6885 2.7781 2.0982 4.4834 4.5571 4.6271 2.5564 1.3915 4.7024 2.0280 4.5823 1.5719 3.1010 1.3579 1.6252 1.5820 1.4228 3.9847 3.9279 2.0953 1.4312 5.0962 2.6181 2.2623 2.1634 1.8941 1.9172 2.2825 2.3805 1.9090 1.9584 2.3074 3.1974 2.0374 1.1114 1.2349 1.5259 1.4355 1.5663 1.2588 1.3050 1.2556 1.3608 1.6555 1.4427 1.6810 1.6964 1.7134 1.7654 2.0794 1.4949 3.2520 1.0840 1.0799 1.1014 1.1080 1.1177 1.0959 2.5324 6.3561 6.7722 8.1560 1.0712 1.0707 1.0703 1.0686 1.0708 1.0625 1.0895 1.0890 1.0887 1.0912 1.0960 1.0894 1.0871 1.0927 1.0953 1.0924 1.0639
irintensity: 0.2108 1.1677 0.5362 0.4530 0.0453 0.2339 0.5245 0.6426 8.8594 2.9698 2.4681 2.6503 0.4039 4.6021 8.8660 8.2959 1.2348 1.7923 6.3560 10.0294 2.6197 5.2701 34.8349 21.5666 6.7103 16.2996 18.4069 121.2630 6.9839 27.1242 20.2681 68.0621 14.1132 8.4365 21.9479 11.9797 0.2003 5.0712 83.9181 26.8743 7.7726 25.6449 124.7666 115.5808 58.3927 8.0090 11.9609 13.1253 67.1097 2.8140 2.6116 70.6846 28.5004 5.3274 0.7711 5.2221 2.8347 143.0242 8.8421 28.9232 8.3718 5.1308 29.3832 21.1621 3.4436 19.4554 31.7394 29.2923 26.8241 49.2220 21.6219 3.6612 24.4471 0.7700 8.3654 71.7962 28.3920 14.7401 127.4188 89.0838 266.9993 210.6287 46.7981 32.6714 154.3311 55.3019 91.1978 9.6469 29.5047 16.6218 41.9108 21.9685 19.5566 19.1524 12.9785 18.4753 5.9550 1.3671 22.4415
temp: 298.150 k
press: 1.00000 atm
elementType: 17 8 8 7 7 6 6 6 6 6 6 6 6 6 6 6 6 6 1 1 1 1 1 1 1 1 1 1 1 1 1 1 1 1 1
symmnumber: 1
zpe: 741995.1 jmol-1
zpe.correction: 0.282611 hartree
zpe.thermalcorrener: 0.300052 hartree
zpe.thermalcorrenthalpy: 0.300996 hartree
zpe.thermalcorrgfe: 0.234318 hartree
zpe.sumelectzpe: -1224.222316 hartree
zpe.sumelectthermal: -1224.204876 hartree
zpe.sumelectthermalent: -1224.203931 hartree
zpe.sumelectthermalfe: -1224.270609 hartree
dipole: 3.1150 2.4733 -0.1272
dipole: 3.9795
quadrupole: -124.5705 -110.0250 -118.3966
quadrupole: -0.1263 -5.0538 2.2984
quadrupole: -6.9065 7.6390 -0.7326 -0.1263 -5.0538 2.2984
hfenergy: -1224.5049272 hartree
pointgroup: C01 [X(C13H17Cl1N2O2)]
dipole: -1.1722943 0.9651138 -0.3815146 debye
polarizability: 257.8485981|-4.4596049|156.1970048|10.4634509|-23.3646936|109.715609 unknown
InChI: InChI=1S/C13H17ClN2O2/c14-11-2-1-3-12(10-11)16-8-6-15(7-9-16)5-4-13(17)18/h1-3,10,17H,4-9H2
charge 0 multiplicity 1
35 atoms
Cl 5.716138 -1.676981 1.50712
O  -6.604732 1.032872 0.299823
O  -6.103526 -1.191344 -0.135673
N  -1.882312 -0.293875 0.189946
N  0.993246 0.075487 0.019419
C  -1.308443 0.897765 -0.481001
C  -0.970097 -1.447002 -0.00532
C  0.070231 1.231731 0.111843
C  0.42198 -1.162601 0.586103
C  -3.265248 -0.606267 -0.244012
C  2.39107 0.284068 0.059591
C  -4.275367 0.432505 0.277975
C  3.260701 -0.65244 0.70107
C  2.989964 1.420564 -0.570658
C  -5.708381 -0.031027 0.112933
C  4.649092 -0.443419 0.670647
C  4.385445 1.598421 -0.565979
C  5.252567 0.664229 0.052052
H  -1.97299 1.765811 -0.324116
H  -1.207604 0.731927 -1.584411
H  -0.854307 -1.695367 -1.091164
H  -1.397738 -2.330434 0.503162
H  0.49053 2.094239 -0.427003
H  -0.063422 1.526619 1.177316
H  0.343481 -1.099727 1.695853
H  1.077271 -2.013214 0.331746
H  -3.350285 -0.687578 -1.35693
H  -3.540465 -1.594294 0.165923
H  -4.173881 1.416327 -0.213014
H  -4.090517 0.601921 1.357263
H  2.870104 -1.516242 1.241758
H  2.369769 2.153685 -1.093905
H  4.814493 2.47403 -1.065719
H  6.337166 0.79495 0.049025
H  -7.537535 0.692664 0.220538
