program: Gaussian 09
title: 000269694
version: EM64L-G09RevD.01
frameworkgroup: C1[X(C10H14N2O)]
method: RPBEPBE
basis: SDD
operation: Freq
keyword: #p
keyword: freq=noraman
keyword: PBEPBE/SDD
title: #p freq=noraman PBEPBE/SDD
converged: YES YES NO NO
title: Mulliken charges:
elementType: O N N C C C C C C C C C C H H H H H H H H H H H H H H
charge: -0.246697 -0.111266 -0.029045 -0.337138 -0.343173 -0.414317 -0.318242 -0.320611 0.097868 -0.314014 -0.190957 -0.368238 -0.177437 0.210721 0.194108 0.202340 0.223204 0.223742 0.225733 0.214505 0.190518 0.189889 0.216247 0.275216 0.237438 0.239500 0.230105
chargesum: 0.00000
title: Mulliken charges with hydrogens summed into heavy atoms:
elementType: O N N C C C C C C C C C C
charge: -0.246697 -0.111266 -0.029045 0.067691 0.082371 0.035158 0.086781 0.085525 0.097868 -0.038798 0.046482 -0.128738 0.052668
polarizability: 1.52900555e+02 -9.43836560e+00 1.08581701e+02 -1.02987936e+01 -9.52321455e+00 9.19120252e+01
1716.lowfreq: -11.7644 -5.6932 -0.0008 -0.0007 -0.0006 15.4184 37.3162 54.1665 68.1750
frequency: 34.4612 54.0088 68.0582 166.3416 191.2375 238.8912 284.5450 301.5666 318.9752 396.1126 405.8833 449.9462 467.1747 485.3463 597.1901 602.0493 626.5034 739.8485 760.8718 779.3057 805.6220 818.4995 840.6682 894.8048 911.7939 957.4448 962.8496 992.1816 1002.6236 1011.6450 1029.1570 1036.2578 1052.3896 1078.0150 1084.4813 1105.4228 1135.0417 1143.8616 1156.3754 1190.5900 1211.1735 1234.3807 1250.8461 1273.5958 1288.5626 1294.2692 1313.3962 1330.4461 1340.9398 1358.4299 1370.9534 1381.5767 1414.2739 1442.0463 1445.8344 1450.8027 1451.5582 1458.2300 1468.6750 1563.8165 1582.3114 2869.6783 2878.3396 2903.3166 2951.5072 2955.3589 2996.0591 3022.9041 3036.0333 3080.5139 3084.4286 3125.5675 3135.9201 3156.5089 3168.4969
redmass: 4.0987 3.3583 4.7078 3.4804 4.1018 1.9244 4.6518 2.8780 2.2108 1.8765 3.4054 3.4829 2.8278 3.9588 5.2085 2.0810 5.3098 3.6540 1.4518 2.6817 3.7259 3.8850 1.6284 2.2151 1.3111 1.5235 5.7180 1.8594 2.6138 1.3763 2.1515 2.1923 1.9520 1.7588 3.5188 2.1318 2.5371 2.4688 1.0864 1.0664 1.2531 2.3366 1.4940 1.3285 1.5845 1.2978 3.9056 1.4217 1.2893 1.4481 1.2674 1.4975 1.9361 1.0835 1.1605 1.1727 1.5140 1.1815 1.1398 5.9568 5.8374 1.0699 1.0695 1.0669 1.0668 1.0667 1.0908 1.0900 1.0900 1.0961 1.0973 1.0875 1.0899 1.0941 1.1013
irintensity: 1.5341 0.3400 0.4342 8.3222 4.3516 1.8047 1.6204 2.8838 11.8165 0.7214 4.6940 3.5227 1.7731 11.8659 2.7580 3.3293 1.7161 1.8065 43.3223 24.4771 29.6906 7.7616 0.3659 16.0190 0.8540 1.5210 3.2860 1.9640 27.9640 0.5402 11.8002 6.7080 21.5871 8.8590 49.7703 0.4369 57.3559 2.5490 0.6861 1.6342 1.9948 0.4594 16.2983 4.9431 13.8085 2.7438 12.7764 4.2643 10.2792 1.5569 2.6388 1.0542 26.5228 2.7611 15.0127 18.4375 33.0075 0.6626 11.7323 12.2085 40.9389 58.3161 82.5153 74.5227 29.3641 105.3435 15.1079 50.0050 32.8711 42.2701 35.5598 10.5102 13.7155 17.1180 24.5120
temp: 298.150 k
press: 1.00000 atm
elementType: 8 7 7 6 6 6 6 6 6 6 6 6 6 1 1 1 1 1 1 1 1 1 1 1 1 1 1
symmnumber: 1
zpe: 594955.5 jmol-1
zpe.correction: 0.226607 hartree
zpe.thermalcorrener: 0.237941 hartree
zpe.thermalcorrenthalpy: 0.238885 hartree
zpe.thermalcorrgfe: 0.188241 hartree
zpe.sumelectzpe: -573.165895 hartree
zpe.sumelectthermal: -573.154561 hartree
zpe.sumelectthermalent: -573.153617 hartree
zpe.sumelectthermalfe: -573.204260 hartree
dipole: -1.4091 1.0104 -1.4200
dipole: 2.2412
quadrupole: -80.5703 -75.5658 -76.9628
quadrupole: -9.3433 -2.5086 1.2521
quadrupole: -2.8707 2.1338 0.7369 -9.3433 -2.5086 1.2521
hfenergy: -573.3925016 hartree
pointgroup: C01 [X(C10H14N2O1)]
dipole: 0.6406631 -0.5779089 -0.1818392 debye
polarizability: 141.7263754|-3.2839683|112.7030711|28.1386287|-0.5219984|98.9648353 unknown
InChI: InChI=1S/C10H14N2O/c1-2-4-11-10(3-1)9-12-5-7-13-8-6-12/h1-4H,5-9H2
charge 0 multiplicity 1
27 atoms
O  -3.819208 -0.429039 -0.419125
N  -1.033969 0.365024 -0.627308
N  2.21732 1.413922 0.771758
C  -2.0435 0.83755 -1.609273
C  -1.670535 0.125973 0.695153
C  0.141373 1.259248 -0.532261
C  -3.178443 -0.193456 -1.724018
C  -2.81104 -0.892627 0.55051
C  1.354439 0.587179 0.102144
C  1.588613 -0.804369 -0.035301
C  2.75274 -1.362563 0.535018
C  3.342299 0.859906 1.312634
C  3.652875 -0.515915 1.224109
H  -1.556707 0.961235 -2.595785
H  -2.478402 1.824926 -1.312605
H  -2.075743 1.076212 1.124437
H  -0.910621 -0.26524 1.396871
H  -0.063369 2.19711 0.036735
H  0.415368 1.56877 -1.561383
H  -3.981809 0.170706 -2.385642
H  -2.771851 -1.149787 -2.118961
H  -2.397183 -1.870194 0.220208
H  -3.354781 -1.021711 1.50077
H  0.853572 -1.406788 -0.5777
H  2.957016 -2.435062 0.443323
H  4.009229 1.55352 1.838282
H  4.567215 -0.906633 1.682012
