program: Gaussian 09
title: 000269681
version: EM64L-G09RevD.01
frameworkgroup: C1[X(C7H7ClO3)]
method: RPBEPBE
basis: SDD
operation: Freq
keyword: #p
keyword: freq=noraman
keyword: PBEPBE/SDD
title: #p freq=noraman PBEPBE/SDD
converged: YES YES NO NO
title: Mulliken charges:
elementType: Cl O O O C C C C C C C H H H H H H H
charge: -0.055039 -0.263117 -0.195634 -0.238623 -0.245110 0.192566 -0.567968 0.210484 -0.318977 -0.250115 -0.144713 0.240023 0.254221 0.266273 0.299791 0.285479 0.261618 0.268842
chargesum: 0.00000
title: Mulliken charges with hydrogens summed into heavy atoms:
elementType: Cl O O O C C C C C C C
charge: -0.055039 -0.263117 -0.195634 -0.238623 0.249135 0.192566 -0.001904 0.210484 -0.033498 0.011503 0.124129
polarizability: 1.25375910e+02 -1.21459617e+01 9.52672337e+01 -9.56997058e+00 -8.25980099e+00 5.80030576e+01
1716.lowfreq: -9.3601 -0.0014 0.0015 0.0023 1.9575 7.0077 33.8824 37.6755 76.4289
frequency: 33.8046 37.6514 76.4186 107.5104 149.4393 184.1335 226.4706 324.2066 372.2255 464.1583 476.9231 587.6626 594.5994 606.4731 714.6830 729.2505 756.4937 814.5634 844.0787 870.2738 887.8236 904.9193 934.1127 981.2064 1012.5346 1044.9671 1053.8124 1079.0456 1146.4171 1176.7657 1212.3830 1242.6093 1264.3192 1304.7529 1367.2343 1369.6886 1431.2341 1442.8355 1454.8619 1539.0157 1654.3152 3010.2896 3061.7017 3114.1632 3150.2569 3229.3009 3249.5196 3270.1757
redmass: 5.7392 11.0662 5.8977 4.1567 5.7324 4.4571 7.5955 4.4604 2.9417 5.1389 4.0146 4.0161 4.0034 4.8825 7.0413 6.4107 1.2458 2.7968 1.3289 6.7165 4.3540 1.3893 2.1622 2.0087 1.6708 2.3167 2.5189 3.8854 1.8700 1.2864 1.5511 1.1619 6.2118 1.1837 1.5363 2.0150 1.1191 1.0952 4.8862 6.1130 10.8222 1.0633 1.0588 1.1011 1.1086 1.0918 1.0996 1.1089
irintensity: 4.8013 2.0086 1.8452 5.0975 1.9963 2.0187 2.3575 9.4085 11.3104 5.5884 3.4140 15.2909 0.2793 21.4221 17.0210 15.6209 89.0013 5.2293 14.0728 6.6723 25.2618 1.4003 12.7117 44.8461 67.0162 50.2635 33.1708 242.6536 40.9000 37.9258 5.4696 3.6323 135.4247 25.4662 5.3476 4.5298 21.2601 20.3745 96.3540 29.0852 270.8925 22.0317 16.1580 4.1411 10.3118 1.9104 1.0375 0.0209
temp: 298.150 k
press: 1.00000 atm
elementType: 17 8 8 8 6 6 6 6 6 6 6 1 1 1 1 1 1 1
symmnumber: 1
zpe: 338311.6 jmol-1
zpe.correction: 0.128856 hartree
zpe.thermalcorrener: 0.139336 hartree
zpe.thermalcorrenthalpy: 0.140280 hartree
zpe.thermalcorrgfe: 0.090207 hartree
zpe.sumelectzpe: -955.828708 hartree
zpe.sumelectthermal: -955.818229 hartree
zpe.sumelectthermalent: -955.817285 hartree
zpe.sumelectthermalfe: -955.867358 hartree
dipole: 1.2332 -0.8232 1.5147
dipole: 2.1196
quadrupole: -56.4201 -73.9134 -70.2654
quadrupole: -13.3697 -3.5667 0.8995
quadrupole: 10.4462 -7.0471 -3.3991 -13.3697 -3.5667 0.8995
hfenergy: -955.9575645 hartree
pointgroup: C01 [X(C7H7Cl1O3)]
dipole: -0.4546684 -0.2459793 -0.65436 debye
dipolederiv: -0.2246168 0.067488 -0.0347831 0.1561104 -0.4816255 0.1249889 -0.0466781 0.0464172 -0.2120405 -1.6525572 0.0999322 0.1528262 0.3044648 -0.4221826 -0.1386506 0.5040345 -0.1024645 -0.4646661 -0.09988 0.0004037 -0.0023255 -0.0117422 -0.4744549 -0.2135071 -0.0195765 -0.2142857 -0.2344476 -0.7383083 -0.181613 -0.0632471 -0.1450358 -0.8499333 -0.2699423 0.0015137 -0.2776664 -0.4695355 0.961399 -0.0094828 -0.0059489 0.2669332 0.0838976 -0.0086419 -0.0071742 -0.0150657 0.2321885 -0.6433351 -0.3562141 -0.0953407 -0.5945416 -0.0645496 0.0712387 -0.2077312 0.046259 0.0546772 0.1014656 -0.0980529 0.0266798 -0.2614062 0.6663959 -0.0925315 0.0148624 -0.1145663 0.0916745 2.1899242 0.3094867 -0.0908948 0.0455821 1.105067 0.4497437 -0.4165644 0.4315755 0.5823013 0.3066366 0.0508989 -0.0571406 0.2315082 -0.008157 0.0268794 0.0496782 0.0529718 -0.0986571 -0.2798326 0.0553963 0.0340509 0.2286702 -0.0484928 0.0448814 0.1432264 0.0742857 -0.1871429 -0.0702733 0.0189605 -0.0092682 -0.1589217 0.2207748 0.2048621 -0.0949541 0.176568 0.0298161 -0.0072114 0.0715943 -0.0349317 -0.0888927 -0.0637374 0.0505158 -0.0836573 0.0363595 0.0847923 -0.0333489 0.0072702 0.0383693 0.0140381 0.1075797 -0.0854353 0.0592568 -0.0297385 -0.0247701 -0.1057172 -0.0546159 -0.013883 -0.0246802 -0.0485537 0.0117637 -0.0385811 0.0355916 0.1124088 0.0972218 0.0489907 0.0846472 0.0567292 -0.0340093 -0.0179319 0.0621855 0.0091784 0.0054687 0.0948799 0.0423793 0.0473182 0.0516603 0.1199864 -0.0446774 0.0508856 -0.0447965 0.1531477 0.0517411 -0.0775857 -0.014255 -0.0847238 0.0715573 -0.0557719 -0.016961 -0.0562276 0.1721919 0.0518127 0.0047636 0.0381271 0.0142477 0.1204375 -0.0577836 0.0462349 -0.0543954 0.1725929 unknown
polarizability: 127.9679687|9.2673234|92.2584201|-2.4000424|12.0500382|58.4198126 unknown
InChI: InChI=1S/C7H7ClO3/c8-3-5-11-7(9)6-2-1-4-10-6/h1-2,4H,3,5H2
charge 0 multiplicity 1
18 atoms
Cl 3.604571 -1.727476 0.974922
O  1.20483 -0.052496 -0.484854
O  -2.172837 0.630328 0.720339
O  0.480444 1.750604 0.83573
C  2.578963 0.496549 -0.431036
C  -1.060963 0.009623 0.110243
C  3.305622 0.130932 0.856817
C  0.231571 0.684938 0.223283
C  -1.461171 -1.18422 -0.48605
C  -2.874946 -1.320734 -0.249261
C  -3.266597 -0.204177 0.479855
H  2.531654 1.600286 -0.50668
H  3.077775 0.071367 -1.314981
H  4.305055 0.592928 0.87709
H  2.73351 0.409343 1.752395
H  -0.804637 -1.866395 -1.020466
H  -3.518627 -2.135643 -0.572829
H  -4.214517 0.137443 0.886383
