program: Gaussian 09
title: 000269709
version: EM64L-G09RevD.01
frameworkgroup: C1[X(C20H32N2S)]
method: RPBEPBE
basis: SDD
operation: Freq
keyword: #p
keyword: freq=noraman
keyword: PBEPBE/SDD
title: #p freq=noraman PBEPBE/SDD
converged: YES YES NO NO
title: Mulliken charges:
elementType: S N N C C C C C C C C C C C C C C C C C C C C H H H H H H H H H H H H H H H H H H H H H H H H H H H H H H H H
charge: -0.062272 -0.021894 -0.176421 -0.374124 -0.405848 -0.424612 -0.392413 -0.362778 -0.456636 -0.370015 -0.253279 -0.386781 -0.381288 0.440851 -0.372798 -0.353486 -0.356412 -0.366774 -0.371424 -0.696164 -0.228678 -0.227542 -0.268040 0.263028 0.251023 0.240539 0.228086 0.237295 0.217166 0.229332 0.220777 0.202998 0.231640 0.201778 0.266971 0.202804 0.187652 0.200096 0.191463 0.195249 0.191385 0.191935 0.188731 0.187176 0.188966 0.194363 0.195686 0.232984 0.228974 0.215626 0.209358 0.210196 0.219356 0.219722 0.226469
chargesum: 0.00000
title: Mulliken charges with hydrogens summed into heavy atoms:
elementType: S N N C C C C C C C C C C C C C C C C C C C C
charge: -0.062272 -0.021894 -0.176421 0.139927 0.062778 0.029849 0.057696 0.071861 0.012113 0.020441 -0.253279 0.004779 0.005346 0.440851 0.007868 0.022656 0.033637 -0.133790 -0.142450 -0.060984 -0.009322 -0.007820 -0.041571
polarizability: 3.12210743e+02 4.44251803e+01 2.51376180e+02 -1.37969292e+01 1.61156373e+01 1.99838761e+02
1716.lowfreq: -5.9908 -0.0023 0.0007 0.0011 1.6429 5.5038 9.4624 17.7153 25.9495
frequency: 6.0227 17.6368 25.6450 31.1010 36.3812 49.2161 57.5285 74.6914 83.6702 88.8984 105.4565 117.7321 130.6775 135.0079 143.8045 147.8370 172.7117 199.3113 213.7860 230.7335 239.2722 256.7764 281.3069 313.3264 326.1201 357.5135 395.1308 412.9621 418.4976 442.6341 451.9273 467.3608 494.5851 510.8928 532.2569 588.8665 611.5993 613.9201 691.6435 692.2168 714.2305 720.0423 724.6298 734.9684 752.6574 760.0249 803.6716 810.0485 844.2777 854.0622 868.6246 886.2759 887.6474 928.9456 951.1879 954.2526 958.9825 975.5038 976.7332 985.9956 990.0648 999.9440 1019.4025 1031.5400 1034.1642 1047.1399 1051.6266 1067.3578 1071.9432 1076.7903 1080.1548 1081.9710 1090.7417 1106.5716 1120.1176 1141.9643 1172.4024 1180.7612 1184.5312 1199.9774 1203.2942 1204.8789 1208.9808 1217.8679 1237.6468 1245.9098 1251.2053 1259.3534 1269.1017 1275.6189 1280.7574 1283.3160 1287.4765 1292.1559 1294.4767 1309.7243 1328.7120 1332.8483 1337.8472 1345.1379 1351.4716 1352.7978 1353.5569 1357.0956 1358.7528 1381.1861 1388.3160 1390.0247 1430.4150 1449.7618 1459.0382 1459.3715 1462.1248 1465.0668 1465.9353 1470.7350 1471.3775 1476.9376 1477.3333 1483.0114 1486.6931 1487.7460 1488.6293 1495.0313 1503.4162 1577.7984 1622.0787 2923.0092 2930.7590 2948.5711 2949.2111 2951.2882 2954.3603 2960.5676 2966.8104 2967.8785 2970.9594 2972.5565 2975.6693 2982.6603 2987.8300 2988.7471 2997.5213 3007.9889 3009.5914 3023.1198 3035.0731 3037.7512 3043.7115 3047.3523 3067.3804 3070.1951 3082.1973 3095.4898 3122.2372 3128.1400 3149.7651 3153.7514 3168.4160
redmass: 4.9375 4.0917 2.1785 2.4025 4.2355 3.9468 4.5471 2.0085 2.4793 3.1203 3.5452 2.1811 2.6862 2.5837 3.5816 2.1557 3.4427 3.9415 4.2612 1.1121 4.0080 2.8022 2.5689 2.9005 3.3866 2.8090 2.8512 2.9684 4.0182 3.6530 3.7353 3.0916 3.1697 2.8006 4.3802 3.5530 2.8821 5.7891 1.8865 3.5374 4.0391 1.0612 1.0821 1.1162 1.8686 1.1869 1.3785 1.2554 1.9374 1.5196 1.4985 1.6042 1.7348 2.7936 1.4471 1.3714 2.0423 1.3765 4.4581 4.3178 4.4798 1.7302 1.3097 2.1192 3.4524 3.0050 1.9294 2.6706 2.1186 2.1540 2.2680 2.1486 1.6273 1.6835 2.5575 3.7464 1.0556 2.4292 1.8274 1.1492 1.3388 1.3218 1.2864 1.3555 1.3106 1.3574 1.4439 1.8231 1.2482 1.4057 1.0438 1.2730 1.1882 1.1273 1.1062 1.3816 1.4166 1.3880 1.3214 1.5224 1.4736 1.6673 1.6361 1.5778 1.5826 2.1024 1.2163 3.5840 3.8190 2.5543 1.0799 1.0739 1.0881 1.0880 1.0796 1.0983 1.0885 1.0645 1.0617 1.0946 1.1655 1.1316 1.0937 1.1019 2.0791 6.0568 6.0425 1.0696 1.0684 1.0587 1.0588 1.0593 1.0596 1.0595 1.0590 1.0650 1.0364 1.0664 1.0673 1.0958 1.0627 1.0970 1.0996 1.0951 1.1022 1.1035 1.1036 1.0900 1.1032 1.1012 1.1008 1.0993 1.0942 1.0923 1.0844 1.0881 1.0912 1.0948 1.1008
irintensity: 0.0539 1.4767 0.2879 0.0507 0.6001 0.0411 2.7577 0.0198 0.0206 0.4159 1.5724 0.3018 0.7756 0.4503 0.7030 0.0648 5.6834 2.9387 2.1860 0.0039 1.5914 0.4908 2.1931 1.0001 2.5104 1.0414 1.9417 1.0990 4.2710 2.4270 2.0534 0.1214 0.9121 12.9694 0.6413 1.2217 1.1588 0.1007 38.8267 2.4605 0.5934 15.3936 0.3036 3.2443 84.7241 1.5778 0.7596 0.0100 7.8761 2.2415 5.0428 2.1370 2.9950 13.8493 2.1964 0.0437 9.5844 0.1565 8.6012 0.9922 0.2941 58.3923 10.6005 11.1720 1.2096 1.6567 1.1395 1.5825 6.4893 0.8712 0.2260 0.5792 5.1431 15.0579 18.8627 6.5829 0.3484 34.5620 16.2142 1.0332 43.4083 9.4506 60.3474 13.0055 2.8728 2.1091 9.7879 18.5375 1.9609 42.7800 3.1651 18.3545 19.4924 1.0777 0.1787 12.2550 2.6826 0.7388 0.6725 1.2705 2.3974 0.3671 0.3715 18.6711 24.0299 132.3000 11.2574 7.0468 330.5846 0.0642 1.4356 0.0776 3.9922 2.8883 5.6195 9.5048 17.1324 9.8071 7.5129 5.0457 79.5331 31.9696 38.7677 11.7360 102.3472 11.5324 222.3330 85.2877 36.0100 0.0281 0.4967 1.5682 0.1653 44.4043 130.9846 12.8631 39.4849 42.6958 73.1844 3.4306 10.9055 3.1573 1.6233 39.4856 1.0874 0.7760 28.1764 20.0263 170.0335 14.7054 96.2579 54.4937 26.2960 14.6065 12.2121 7.8944 34.8907 39.2121 10.2865
temp: 298.150 k
press: 1.00000 atm
elementType: 16 7 7 6 6 6 6 6 6 6 6 6 6 6 6 6 6 6 6 6 6 6 6 1 1 1 1 1 1 1 1 1 1 1 1 1 1 1 1 1 1 1 1 1 1 1 1 1 1 1 1 1 1 1 1
symmnumber: 1
zpe: 1263921.4 jmol-1
zpe.correction: 0.481402 hartree
zpe.thermalcorrener: 0.506871 hartree
zpe.thermalcorrenthalpy: 0.507815 hartree
zpe.thermalcorrgfe: 0.420220 hartree
zpe.sumelectzpe: -1287.095333 hartree
zpe.sumelectthermal: -1287.069865 hartree
zpe.sumelectthermalent: -1287.068920 hartree
zpe.sumelectthermalfe: -1287.156516 hartree
dipole: 1.0803 -3.8667 -0.6184
dipole: 4.0621
quadrupole: -153.2543 -175.2223 -143.4757
quadrupole: 1.7273 -2.7418 2.0286
quadrupole: 4.0631 -17.9049 13.8417 1.7273 -2.7418 2.0286
hfenergy: -1287.5767354 hartree
pointgroup: C01 [X(C20H32N2S1)]
dipole: 0.377397 -1.4224506 -0.6231152 debye
polarizability: 314.1971077|45.3544208|238.2984415|-4.1363378|25.520939|210.9301345 unknown
InChI: InChI=1S/C20H32N2S/c1-2-3-4-5-6-7-11-14-20(23)22-17-15-21(16-18-22)19-12-9-8-10-13-19/h8-10,12-13H,2-7,11,14-18H2,1H3
charge 0 multiplicity 1
55 atoms
S  -0.389317 4.094982 1.325371
N  -1.240548 1.68284 0.410349
N  -3.577512 -0.067829 0.129535
C  -2.477617 1.891293 1.209847
C  -1.207101 0.426998 -0.379207
C  -3.256745 0.579972 1.413517
C  -2.597753 0.100352 -0.956171
C  1.989224 1.384049 0.345325
C  1.025094 2.367089 -0.37709
C  3.301546 1.168896 -0.440585
C  -0.249604 2.637928 0.413933
C  4.291649 0.227095 0.281625
C  5.593984 -0.013934 -0.514351
C  -4.730181 -0.851743 -0.044735
C  6.592238 -0.942963 0.21322
C  7.887738 -1.198143 -0.589346
C  8.88902 -2.121608 0.142082
C  -5.146772 -1.262342 -1.349977
C  -5.522748 -1.266771 1.071007
C  10.178551 -2.37566 -0.668108
C  -6.301967 -2.0515 -1.522038
C  -6.68029 -2.047848 0.879737
C  -7.084059 -2.45165 -0.414111
H  -2.189369 2.325704 2.184151
H  -3.110488 2.648038 0.705769
H  -0.490931 0.526736 -1.208462
H  -0.868429 -0.415034 0.258017
H  -4.195661 0.84282 1.933383
H  -2.689237 -0.098069 2.089223
H  -2.513474 -0.843911 -1.529044
H  -2.89897 0.897033 -1.67174
H  1.494353 0.405182 0.508674
H  2.215816 1.795493 1.348224
H  0.805547 1.988267 -1.396929
H  1.53295 3.336851 -0.500478
H  3.789047 2.150687 -0.612516
H  3.069434 0.755993 -1.445211
H  4.542164 0.652963 1.275356
H  3.796969 -0.74769 0.477057
H  6.084253 0.960722 -0.719392
H  5.343297 -0.449479 -1.504528
H  6.852411 -0.501044 1.197924
H  6.098586 -1.913764 0.429781
H  7.6293 -1.645723 -1.572156
H  8.380869 -0.22827 -0.810529
H  8.39472 -3.089142 0.366273
H  9.148979 -1.671896 1.122242
H  -4.588395 -0.942342 -2.23533
H  -5.224062 -1.006403 2.091181
H  10.876666 -3.037515 -0.123092
H  9.948626 -2.853273 -1.639437
H  10.707496 -1.426916 -0.878988
H  -6.598332 -2.345657 -2.535842
H  -7.265145 -2.353333 1.755396
H  -7.982422 -3.061228 -0.554405
