program: Gaussian 09
title: 000269703
version: EM64L-G09RevD.01
frameworkgroup: C1[X(C20H25ClN2O2)]
method: RPBEPBE
basis: SDD
operation: Freq
keyword: #p
keyword: freq=noraman
keyword: PBEPBE/SDD
title: #p freq=noraman PBEPBE/SDD
converged: YES YES NO NO
title: Mulliken charges:
elementType: Cl O O N N C C C C C C C C C C C C C C C C C C C C H H H H H H H H H H H H H H H H H H H H H H H H H
charge: -0.043750 -0.457092 -0.290038 -0.106271 -0.174167 -0.358600 -0.370191 -0.389340 -0.403510 -0.382628 -0.118975 0.465213 -0.307626 -0.381094 -0.370672 -0.367621 -0.440087 0.448393 0.507061 -0.812530 -0.317031 -0.330624 -0.208996 -0.228324 -0.241366 0.197317 0.206449 0.212288 0.191772 0.210529 0.208646 0.218527 0.202907 0.222370 0.223729 0.214946 0.221200 0.238742 0.215588 0.232109 0.365954 0.222924 0.222892 0.225324 0.226865 0.221340 0.256405 0.255798 0.230310 0.234933
chargesum: 0.00000
title: Mulliken charges with hydrogens summed into heavy atoms:
elementType: Cl O O N N C C C C C C C C C C C C C C C C C C C C
charge: -0.043750 -0.091138 -0.290038 -0.106271 -0.174167 0.045166 0.033869 0.029835 0.017924 0.063471 0.095972 0.465213 0.152317 -0.165506 -0.138563 -0.144697 -0.217196 0.448393 0.507061 -0.139001 -0.317031 -0.074219 0.046802 0.001986 -0.006433
polarizability: 3.34298790e+02 2.19196697e+01 2.20772839e+02 -5.36086536e+00 -2.56036017e+01 2.00369011e+02
1716.lowfreq: -16.4998 -5.0205 -0.0009 0.0008 0.0013 2.7254 11.0282 13.4846 18.9922
frequency: 8.4218 11.3540 18.9840 34.2005 47.4127 50.3724 53.3551 69.1025 75.1731 108.1081 126.1678 142.7217 154.1187 179.0835 215.8594 217.8436 228.6798 242.6339 260.0628 277.4979 302.2732 326.6834 349.3783 355.4962 385.4364 390.0944 410.2676 433.5581 439.0397 445.3293 449.0236 474.9215 475.7119 513.2061 525.0311 534.9023 539.5577 595.0277 606.8857 638.2842 671.2346 686.7095 706.1919 713.2213 750.7189 777.8248 791.7974 798.9056 807.9097 816.0634 837.8881 845.9001 853.9805 909.9073 919.9083 925.7933 927.2057 952.4934 953.6089 970.2752 975.3552 985.2211 998.6072 1005.6881 1020.3338 1036.4911 1042.8503 1046.0617 1049.0390 1063.1683 1072.6100 1087.2164 1110.9108 1129.2615 1131.5917 1140.3459 1145.0778 1168.7516 1171.9488 1198.6364 1202.0733 1207.7402 1226.3889 1234.0077 1236.9533 1242.1320 1259.7235 1266.0299 1281.1241 1298.1361 1312.9542 1316.6545 1328.0833 1340.9163 1348.5734 1354.6382 1364.0987 1370.1794 1377.4373 1380.4601 1391.1736 1398.2197 1403.0832 1422.2566 1428.9521 1452.4212 1456.1731 1457.0015 1461.5304 1467.6719 1470.8742 1472.2547 1476.2336 1476.9712 1516.1270 1572.7746 1575.1382 1604.7229 1632.3494 2865.2881 2871.7471 2898.2173 2901.4188 2910.4376 2960.4562 2969.3037 2981.4285 3032.5327 3039.3922 3043.6295 3044.6956 3049.6804 3063.8646 3076.9663 3088.8274 3113.1911 3117.7507 3139.4553 3148.6933 3155.3400 3159.3128 3167.0391 3178.3898 3537.9315
redmass: 3.8317 5.5460 6.0867 4.6411 1.1502 4.7106 2.7720 5.6979 5.4022 3.8122 3.7740 4.0617 5.2882 3.9192 5.7310 4.5208 2.6623 2.6215 5.4782 2.6987 2.5817 3.0603 3.2154 4.7601 8.9150 2.1757 2.8943 3.1767 3.2157 3.0071 1.2801 2.7675 2.4811 3.3398 3.0565 4.7403 3.8607 5.8530 2.4894 6.7828 6.7338 2.9955 3.6187 2.8235 1.2725 3.3143 4.3420 5.7356 1.6463 1.3899 1.4342 1.5703 2.4177 1.8348 3.6266 1.3730 1.3795 2.0817 1.3714 1.3160 6.1108 1.4442 2.5114 2.6664 7.1841 2.2000 2.0478 1.5161 1.9061 2.1054 2.0542 2.3499 2.4947 1.5465 1.3815 2.1764 2.5998 1.7653 1.0919 1.2342 1.1270 1.4312 2.3023 2.3842 1.7404 1.4558 1.2500 1.5369 1.3554 1.3938 1.3089 1.3222 1.2836 1.3957 1.4788 1.8638 1.6367 1.9254 2.4271 3.2908 1.5071 1.2393 1.6896 3.4586 2.3281 1.1495 1.1574 1.0881 1.1011 1.1011 1.0461 2.0197 1.0981 1.1045 2.7536 5.7573 6.4055 7.2226 6.3913 1.0709 1.0698 1.0693 1.0690 1.0708 1.0828 1.0373 1.0573 1.0905 1.0905 1.0900 1.0977 1.0899 1.1063 1.0982 1.0885 1.0883 1.0888 1.0858 1.0937 1.0900 1.0935 1.0943 1.1003 1.0655
irintensity: 0.7233 0.1576 0.3779 0.2768 0.6760 0.7940 1.5679 0.2000 1.5483 2.0227 0.7274 2.0374 2.7372 2.6537 1.4762 5.9642 5.7372 2.2643 0.7635 4.4600 3.0000 6.0704 6.3846 6.2731 5.2441 1.2366 0.5491 10.2813 6.3868 22.8451 110.5425 5.8982 40.5461 15.4489 13.7892 3.8361 0.7766 7.2501 0.2286 0.1325 26.2373 7.7237 0.4857 2.2591 104.1592 19.4415 2.8957 12.9525 54.7526 1.5441 0.9363 4.0215 5.0469 16.3260 41.5771 2.2776 4.3145 6.5137 1.6392 0.3924 102.9619 3.3142 64.2649 13.5986 63.1515 42.9124 25.6866 10.4135 26.2641 3.1233 2.4107 3.4973 28.6477 10.5046 7.4387 34.9368 44.7180 20.3734 6.7982 2.5818 2.1085 12.0238 70.2614 208.0949 50.9265 89.9340 14.1087 44.9088 33.0611 30.1467 15.1966 2.1468 8.3968 0.8204 0.8623 26.1203 8.7508 13.9563 42.5215 4.9574 9.1663 7.2229 8.2556 4.7868 27.2662 46.5004 39.6363 6.5720 38.7581 29.9626 11.5113 82.3257 6.0284 10.8724 210.6064 12.3858 15.6024 52.5434 77.2756 51.9316 60.8869 40.0659 104.3831 155.6001 37.2187 64.7317 24.2737 17.6715 47.4213 52.8801 26.8146 24.9682 37.3988 20.5419 20.5019 17.7901 34.1600 2.3381 28.6771 11.6841 12.2433 13.6998 9.6440 20.7642
temp: 298.150 k
press: 1.00000 atm
elementType: 17 8 8 7 7 6 6 6 6 6 6 6 6 6 6 6 6 6 6 6 6 6 6 6 6 1 1 1 1 1 1 1 1 1 1 1 1 1 1 1 1 1 1 1 1 1 1 1 1 1
symmnumber: 1
zpe: 1079672.7 jmol-1
zpe.correction: 0.411226 hartree
zpe.thermalcorrener: 0.435733 hartree
zpe.thermalcorrenthalpy: 0.436677 hartree
zpe.thermalcorrgfe: 0.351816 hartree
zpe.sumelectzpe: -1495.231765 hartree
zpe.sumelectthermal: -1495.207258 hartree
zpe.sumelectthermalent: -1495.206314 hartree
zpe.sumelectthermalfe: -1495.291175 hartree
dipole: 1.0368 2.3269 -1.2571
dipole: 2.8408
quadrupole: -163.6690 -158.4749 -149.0083
quadrupole: -11.9716 4.0246 -5.5992
quadrupole: -6.6183 -1.4242 8.0424 -11.9716 4.0246 -5.5992
hfenergy: -1495.6429908 hartree
pointgroup: C01 [X(C20H25Cl1N2O2)]
dipole: 0.385559 0.7236259 -0.7595018 debye
polarizability: 333.5476744|17.2959412|204.1240632|-16.2114058|-27.4379378|217.7689032 unknown
InChI: InChI=1S/C20H25ClN2O2/c1-16-6-8-17(9-7-16)23-12-10-22(11-13-23)14-18(24)15-25-20-5-3-2-4-19(20)21/h2-9,18,24H,10-15H2,1H3
charge 0 multiplicity 1
50 atoms
Cl -6.52135 -0.054512 1.940116
O  -3.229853 -3.042297 0.711831
O  -3.96517 -0.382488 0.490037
N  0.165069 -1.676152 -0.073573
N  2.887894 -0.668897 -0.020295
C  0.830829 -1.340678 1.211666
C  1.185255 -2.163658 -1.034788
C  1.891684 -0.250793 0.992934
C  2.265796 -1.096952 -1.286985
C  -0.95688 -2.63421 0.084517
C  -2.216682 -1.981749 0.679209
C  4.161545 -0.036652 -0.051403
C  -2.704316 -0.797471 -0.163601
C  4.852958 0.274401 1.159292
C  4.822988 0.27262 -1.275773
C  6.132566 0.857366 1.136402
C  6.113881 0.846648 -1.280001
C  6.799622 1.155201 -0.082054
C  -4.713712 0.644122 -0.081465
C  8.187507 1.772994 -0.08911
C  -5.969855 0.933089 0.513438
C  -4.302673 1.411001 -1.201154
C  -6.797305 1.955511 0.022405
C  -5.132389 2.440194 -1.699768
C  -6.376556 2.718064 -1.09383
H  1.315487 -2.244315 1.660272
H  0.07929 -0.965436 1.929131
H  0.688181 -2.402591 -1.993149
H  1.681636 -3.09449 -0.660901
H  1.379892 0.685365 0.66878
H  2.394005 -0.043358 1.950364
H  3.039635 -1.54217 -1.936508
H  1.809871 -0.235851 -1.831039
H  -1.224624 -3.031611 -0.912316
H  -0.690021 -3.511024 0.722027
H  -2.02822 -1.614793 1.710904
H  -2.914261 -1.115222 -1.204446
H  -1.965086 0.024262 -0.158316
H  4.402998 0.032787 2.127701
H  4.331554 0.089163 -2.235643
H  -4.085041 -2.625945 0.997605
H  6.632228 1.07442 2.089402
H  6.589388 1.069603 -2.243511
H  8.208059 2.734775 0.457994
H  8.930091 1.109434 0.394537
H  8.536006 1.966949 -1.118572
H  -3.339428 1.208772 -1.678154
H  -7.759257 2.149798 0.505737
H  -4.800114 3.024213 -2.564567
H  -7.019224 3.515061 -1.480079
