program: Gaussian 09
title: 000269647
version: EM64L-G09RevD.01
frameworkgroup: C1[X(C11H15N3O2)]
method: RPBEPBE
basis: SDD
operation: Freq
keyword: #p
keyword: freq=noraman
keyword: PBEPBE/SDD
title: #p freq=noraman PBEPBE/SDD
converged: YES YES NO NO
title: Mulliken charges:
elementType: O O N N N C C C C C C C C C C C H H H H H H H H H H H H H H H
charge: -0.198047 -0.205330 -0.415518 -0.063346 0.031486 -0.029968 -0.426105 -0.464795 -0.399262 -0.412748 -0.377052 0.225315 -0.462130 0.421859 -0.320813 -0.316699 0.253253 0.240593 0.194625 0.205795 0.217652 0.199881 0.205561 0.212550 0.180307 0.195178 0.204549 0.303122 0.275971 0.244498 0.279617
chargesum: 0.00000
title: Mulliken charges with hydrogens summed into heavy atoms:
elementType: O O N N N C C C C C C C C C C C
charge: -0.198047 -0.205330 -0.112396 -0.063346 0.031486 0.223286 0.009113 -0.041348 0.006180 -0.019891 0.022674 0.225315 -0.186158 0.421859 -0.076315 -0.037082
polarizability: 2.15486842e+02 -8.85382012e+00 1.48013157e+02 -8.63566877e+00 2.05024889e+00 9.26327162e+01
1716.lowfreq: -8.4312 0.0003 0.0005 0.0007 6.6237 16.8665 38.4067 45.0069 57.0782
frequency: 37.4235 44.5210 57.0635 72.5460 137.2983 164.3034 180.7123 206.8277 221.5029 262.4828 336.1805 366.2436 379.9483 424.8385 429.2665 438.8604 461.1016 479.7258 525.1066 545.5777 612.6931 659.7258 668.1525 710.7895 722.9687 773.2732 778.7824 801.3248 824.8480 828.8648 862.3671 872.9107 888.1584 888.7884 921.3130 955.8984 960.0990 1006.8133 1011.2261 1047.8735 1052.5024 1078.8222 1087.6651 1089.8648 1114.2759 1148.2352 1156.2513 1212.6619 1231.8101 1248.6763 1258.5981 1272.1666 1293.7062 1310.4900 1327.3362 1329.6166 1333.6971 1336.4689 1349.3895 1355.7339 1367.0516 1380.7785 1400.4861 1457.1424 1457.9998 1461.6180 1468.2495 1473.3096 1477.5138 1489.8889 1556.4570 1610.2980 2949.8413 2967.3565 2971.6946 2978.1303 2983.8280 3027.5482 3030.0648 3033.2330 3039.4066 3044.9721 3056.9498 3140.6996 3169.4484 3207.4823 3563.3207
redmass: 4.9583 4.4470 7.4079 4.1680 4.2227 4.4740 5.7267 3.5103 3.0356 2.7636 2.7730 2.1516 3.8180 2.7157 3.5931 1.6202 2.0926 2.2147 5.4903 5.0422 3.2921 3.7319 9.2730 3.8370 5.1015 1.5440 7.1027 3.4770 1.9345 1.3436 2.3734 2.0901 2.6985 1.8000 1.4398 4.5397 1.3832 2.7420 2.4199 1.4644 1.7721 1.6924 1.7080 1.6766 1.0484 2.1468 1.8888 3.8577 1.9831 1.4161 1.2902 1.3295 1.6965 1.9168 1.8893 1.4585 1.5000 1.8259 1.4827 1.4910 1.5019 4.7411 2.4936 1.2595 1.3941 1.1006 1.1261 1.1159 1.3588 2.3816 4.6911 8.3675 1.0678 1.0631 1.0637 1.0636 1.0622 1.0905 1.0931 1.0922 1.1008 1.1014 1.0988 1.0912 1.0925 1.0952 1.0772
irintensity: 0.1092 0.0292 0.0474 0.0622 0.2059 2.7083 10.3670 1.3174 0.9744 1.5693 2.1072 0.5286 1.0632 3.7473 2.4587 55.7580 17.7672 15.0930 1.8475 2.1596 7.9132 3.2440 15.3064 26.5906 1.2467 0.5784 23.2797 4.4723 1.0727 25.4541 7.4536 8.4982 16.7172 30.7051 8.4950 8.2082 0.5128 11.0875 5.7332 0.8154 1.1527 15.5122 1.3936 0.0352 2.0605 14.5894 13.5825 147.7224 41.9301 23.6785 8.7607 18.2181 10.9558 4.5107 2.7573 6.3901 1.9719 9.0721 6.9629 2.1444 18.5939 104.8851 52.8481 9.5670 13.0896 3.0709 13.1985 17.6688 148.1985 187.1456 161.9562 293.0362 32.9429 37.7679 27.7035 22.5367 30.3618 63.2413 77.4304 20.2929 24.4199 78.7152 55.1263 24.7699 3.9712 5.2787 62.1918
temp: 298.150 k
press: 1.00000 atm
elementType: 8 8 7 7 7 6 6 6 6 6 6 6 6 6 6 6 1 1 1 1 1 1 1 1 1 1 1 1 1 1 1
symmnumber: 1
zpe: 663455.7 jmol-1
zpe.correction: 0.252697 hartree
zpe.thermalcorrener: 0.266932 hartree
zpe.thermalcorrenthalpy: 0.267876 hartree
zpe.thermalcorrgfe: 0.210431 hartree
zpe.sumelectzpe: -741.594839 hartree
zpe.sumelectthermal: -741.580603 hartree
zpe.sumelectthermalent: -741.579659 hartree
zpe.sumelectthermalfe: -741.637105 hartree
dipole: 5.3423 0.6701 -0.5288
dipole: 5.4101
quadrupole: -109.8128 -95.0929 -95.1943
quadrupole: -11.8261 0.2918 1.4125
quadrupole: -9.7795 4.9404 4.8391 -11.8261 0.2918 1.4125
hfenergy: -741.8475357 hartree
pointgroup: C01 [X(C11H15N3O2)]
dipole: -2.1033444 -0.2636103 -0.1923102 debye
polarizability: 215.5568072|-8.8403966|147.9670752|8.0644017|-2.8167365|92.6088334 unknown
InChI: InChI=1S/C11H15N3O2/c15-14(16)10-6-7-12-11(8-10)13-9-4-2-1-3-5-9/h6-9,13H,1-5H2
charge 0 multiplicity 1
31 atoms
O  4.958983 0.373445 0.296831
O  3.624185 2.208513 0.082466
N  -1.034529 0.265674 -0.471938
N  0.366918 -1.61305 -0.221349
N  3.808843 0.932636 0.137657
C  -2.247143 -0.576325 -0.604715
C  -2.773094 -1.050533 0.77927
C  -3.340492 0.209448 -1.368713
C  -3.357456 0.113047 1.613637
C  -3.939771 1.3707 -0.533999
C  -4.461671 0.867562 0.833873
C  0.231682 -0.242722 -0.281783
C  1.360557 0.634199 -0.165396
C  2.617126 0.045032 0.010311
C  1.616467 -2.129523 -0.056339
C  2.790325 -1.358148 0.069276
H  -1.946496 -1.467854 -1.184715
H  -1.953849 -1.559261 1.318496
H  -3.562153 -1.809752 0.600451
H  -4.152611 -0.501928 -1.615848
H  -2.935102 0.582301 -2.329399
H  -2.545443 0.820667 1.880122
H  -3.760931 -0.2757 2.568038
H  -4.756031 1.853021 -1.104832
H  -3.179033 2.163536 -0.364498
H  -5.318847 0.183286 0.664175
H  -4.84383 1.716708 1.432551
H  -1.145921 1.27943 -0.49778
H  1.264376 1.722349 -0.211565
H  1.671047 -3.223187 -0.019645
H  3.775795 -1.804373 0.206456
