program: Gaussian 09
title: 000023047
version: EM64L-G09RevD.01
frameworkgroup: C1[X(C10H15O5PS)]
method: RPBEPBE
basis: SDD
operation: Freq
keyword: #p
keyword: freq=noraman
keyword: PBEPBE/SDD
title: #p freq=noraman PBEPBE/SDD
converged: YES YES NO NO
title: Mulliken charges:
elementType: S P O O O O O C C C C C C C C C C H H H H H H H H H H H H H H H
charge: 0.648369 1.397654 -0.560225 -0.505215 -0.492449 -0.618280 -0.594040 0.522981 -0.407635 0.401169 -0.541251 -0.169780 -0.366768 -0.818474 -0.800880 -0.482874 -0.478487 0.261073 0.311817 0.297318 0.240721 0.238189 0.237842 0.271856 0.290457 0.244865 0.244824 0.235519 0.255879 0.239790 0.251622 0.244411
chargesum: 0.00000
title: Mulliken charges with hydrogens summed into heavy atoms:
elementType: S P O O O O O C C C C C C C C C C
charge: 0.648369 1.397654 -0.560225 -0.505215 -0.492449 -0.618280 -0.594040 0.522981 -0.407635 0.401169 -0.280178 0.142037 -0.069449 -0.101722 0.006298 0.253348 0.257336
polarizability: 2.34644428e+02 4.25702058e+00 1.68181393e+02 -3.17381342e-01 7.53008981e+00 1.18988532e+02
1716.lowfreq: -11.5636 -2.8621 -0.0020 -0.0013 -0.0008 4.4958 11.4049 28.0895 55.5681
frequency: 11.0517 27.8812 55.5350 59.1235 66.2860 67.5602 73.9662 91.6038 106.0902 110.3045 136.0553 144.8764 157.1698 175.9995 191.1676 209.1008 210.7272 228.8547 247.3565 273.4391 304.1062 333.1589 346.1036 371.4982 407.5708 410.2150 456.9462 470.7804 531.3567 541.0995 562.2519 592.5829 597.5766 683.6814 698.5265 724.3903 754.9416 788.6945 858.9755 886.8894 925.2208 951.0768 957.2924 959.8796 966.5063 991.6018 999.2236 1003.4245 1043.2985 1062.8449 1112.4555 1113.6540 1130.0025 1130.7073 1135.1412 1150.1643 1220.2075 1260.4793 1300.9084 1377.8989 1398.6887 1406.2631 1415.7248 1423.3848 1427.5964 1429.1081 1452.3088 1456.8995 1457.7554 1471.9656 1473.7632 1474.3683 1477.0282 1575.0468 1611.4928 2974.6710 2994.5878 2997.5430 3017.3973 3054.5090 3091.1826 3100.7321 3105.8804 3106.9433 3135.8819 3138.5492 3155.5123 3158.0966 3158.2032 3167.3625
redmass: 4.3582 4.6691 2.8004 3.1355 1.4431 3.1098 2.7246 2.6357 1.0485 1.4384 1.7534 2.9751 2.1282 4.3966 3.6171 4.5934 5.7150 5.9134 6.4164 4.5251 5.8608 8.4131 7.9241 6.8314 6.2776 6.7880 3.0498 4.7807 6.1740 6.3468 5.9606 5.8190 6.3960 8.7406 10.5363 3.2661 8.6086 13.2898 1.3044 1.4822 3.1966 1.2775 3.0052 1.8736 11.0386 1.3337 1.8207 3.7114 1.5499 14.6507 1.2362 1.2339 1.2805 1.5052 1.4484 1.4794 2.8826 1.5926 1.1408 8.2738 1.2190 3.0857 1.0598 1.1262 1.1190 1.0630 2.3112 1.0558 1.0589 1.0529 1.0566 1.0678 1.1814 6.0335 7.7889 1.0393 1.0290 1.0288 1.0255 1.0956 1.0987 1.1058 1.0903 1.1054 1.1045 1.1050 1.0922 1.0969 1.1038 1.1070
irintensity: 1.2007 3.1772 0.8127 3.4608 1.4135 1.0665 4.8748 2.6557 0.8998 0.2981 7.7977 1.5754 4.6425 4.9946 1.9906 3.5796 3.2235 5.4654 20.5160 8.6532 2.1832 22.1848 3.9606 22.2027 8.0016 33.2581 6.2318 41.0339 11.1960 3.2579 18.6582 41.1428 21.7788 83.6405 142.8603 0.1516 202.0108 39.5782 36.0010 31.7876 185.3327 45.7688 126.9006 71.3161 164.7754 0.0548 20.2224 11.7461 11.2137 129.5503 0.6023 0.9349 0.5302 46.6771 32.0824 23.4154 136.1812 36.4564 6.9604 1.0100 11.1204 12.5773 16.3420 3.0003 3.6233 15.4630 61.9541 13.4813 12.2951 21.7179 19.2481 18.7238 64.2172 66.9686 28.8087 22.8908 48.8502 36.8067 10.1292 15.4221 16.5478 24.3555 13.0118 24.1216 9.6458 14.5052 3.0516 0.3631 10.3232 5.1470
temp: 298.150 k
press: 1.00000 atm
elementType: 16 15 8 8 8 8 8 6 6 6 6 6 6 6 6 6 6 1 1 1 1 1 1 1 1 1 1 1 1 1 1 1
symmnumber: 1
zpe: 622452.5 jmol-1
zpe.correction: 0.237080 hartree
zpe.thermalcorrener: 0.258407 hartree
zpe.thermalcorrenthalpy: 0.259351 hartree
zpe.thermalcorrgfe: 0.183940 hartree
zpe.sumelectzpe: -1504.047106 hartree
zpe.sumelectthermal: -1504.025778 hartree
zpe.sumelectthermalent: -1504.024834 hartree
zpe.sumelectthermalfe: -1504.100245 hartree
dipole: 1.1130 6.2795 2.8002
dipole: 6.9651
quadrupole: -108.8112 -115.3245 -116.1175
quadrupole: -12.9233 14.5537 -4.5754
quadrupole: 4.6065 -1.9068 -2.6998 -12.9233 14.5537 -4.5754
hfenergy: -1504.2841855 hartree
pointgroup: C01 [X(C10H15O5P1S1)]
dipole: 0.3002939 -2.406082 -1.2765955 debye
polarizability: 234.0973037|-6.8258107|167.4122842|-2.6989703|10.9931874|120.3047651 unknown
InChI: InChI=1S/C10H15O5PS/c1-8-7-9(5-6-10(8)17(4)12)15-16(11,13-2)14-3/h5-7H,1-4H3
charge 0 multiplicity 1
32 atoms
S  -4.146342 0.811495 -0.198134
P  3.053567 0.407664 0.391255
O  1.719156 -0.699236 0.539204
O  3.098085 0.564592 -1.33176
O  4.317132 -0.649757 0.831409
O  -4.140252 2.395886 0.346691
O  3.038891 1.763208 1.207658
C  -1.851395 -0.985333 -0.448283
C  -2.325637 0.259061 0.032038
C  0.363563 -0.303155 0.358829
C  -0.469901 -1.248439 -0.27471
C  -1.499876 1.215647 0.641529
C  -0.13006 0.935129 0.828036
C  -2.753739 -2.008906 -1.115901
C  -4.865004 -0.160721 1.306846
C  3.560107 1.85446 -1.909638
C  4.45201 -1.978088 0.178147
H  -0.031327 -2.184649 -0.634586
H  -1.953003 2.167597 0.951427
H  0.533911 1.653834 1.319198
H  -2.168686 -2.700228 -1.745089
H  -3.289875 -2.623107 -0.366438
H  -3.51554 -1.529079 -1.756966
H  -5.916378 0.152072 1.38521
H  -4.284222 0.162966 2.181964
H  -4.774434 -1.242238 1.125595
H  3.197621 1.836131 -2.947806
H  4.662228 1.911453 -1.887035
H  3.125674 2.706953 -1.360021
H  4.549617 -1.86461 -0.915795
H  3.585166 -2.612385 0.426088
H  5.375144 -2.394516 0.606737
