program: Gaussian 09
title: 000269627
version: EM64L-G09RevD.01
frameworkgroup: C1[X(C11H13NO4)]
method: RPBEPBE
basis: SDD
operation: Freq
keyword: #p
keyword: freq=noraman
keyword: PBEPBE/SDD
title: #p freq=noraman PBEPBE/SDD
converged: YES YES NO NO
title: Mulliken charges:
elementType: O O O O N C C C C C C C C C C C H H H H H H H H H H H H H
charge: -0.245055 -0.203119 -0.220855 -0.219016 0.021262 -0.394742 -0.484149 -0.305681 0.225186 0.362374 -0.309401 -0.342412 -0.765264 0.375981 -0.360891 -0.333636 0.235658 0.247352 0.228411 0.232412 0.210694 0.211160 0.258721 0.265579 0.231240 0.243473 0.261398 0.284578 0.288741
chargesum: 0.00000
title: Mulliken charges with hydrogens summed into heavy atoms:
elementType: O O O O N C C C C C C C C C C C
charge: -0.245055 -0.203119 -0.220855 -0.219016 0.021262 0.088269 -0.023326 0.116173 0.225186 0.362374 -0.050680 -0.076833 -0.029154 0.375981 -0.076313 -0.044896
polarizability: 2.42585343e+02 -1.73046315e+00 1.41418358e+02 -8.82815543e-01 3.88318904e-01 7.29311052e+01
1716.lowfreq: -14.0530 -7.4363 -2.4014 -0.0004 0.0002 0.0004 21.2182 26.0189 44.1611
frequency: 21.1917 26.0045 44.1265 65.1659 72.1242 82.9387 97.7408 125.6410 129.7662 157.2596 188.8441 232.8687 298.0462 313.5355 356.2141 419.5761 441.1929 462.0085 469.1613 495.7362 517.9024 579.7263 621.6469 633.5221 665.3666 734.0070 737.0041 755.4794 804.5799 814.6502 827.3391 838.7919 854.1039 945.4269 960.4122 966.2864 975.2686 988.8566 993.7316 1070.6418 1089.0278 1097.0514 1104.3536 1111.0954 1165.9344 1168.2283 1171.5208 1226.5749 1236.6089 1262.2467 1270.5577 1283.0434 1291.8795 1348.2329 1353.7407 1370.6980 1383.1116 1404.0244 1433.4553 1436.0732 1443.4325 1456.5502 1465.2315 1475.0399 1485.5529 1587.1232 1612.2984 1640.3171 2951.4133 2956.3691 2981.5770 3004.0104 3013.0834 3025.7452 3068.0032 3091.2536 3121.6530 3165.2964 3168.5293 3184.7348 3189.8172
redmass: 7.5112 4.0830 5.6770 4.0337 4.6569 1.1658 1.8437 3.5974 6.9396 3.0558 6.4302 5.4371 6.9187 4.7586 5.3948 3.0200 3.3852 2.3638 5.2532 3.0266 5.7630 4.3305 7.0298 7.4131 4.5107 4.8128 1.1831 8.3906 5.0123 1.3434 2.8681 1.4413 1.6399 1.8090 1.4863 4.7941 1.3371 1.3339 2.8924 2.9905 2.9029 3.1208 1.8947 1.2485 1.3093 1.4022 1.9927 5.3476 4.0111 1.2292 1.4269 1.1043 1.2882 1.6458 6.8163 1.2400 1.6169 5.9901 1.0965 4.4011 1.0686 1.0580 1.1517 1.5623 1.3812 7.7865 6.5451 7.8997 1.0555 1.0605 1.0386 1.0967 1.1071 1.0609 1.0948 1.1039 1.1004 1.0883 1.0892 1.0961 1.0972
irintensity: 5.7729 1.2341 2.5452 0.1742 0.1822 0.1418 0.8848 1.4417 1.6797 6.6089 0.7896 4.1854 0.1027 8.0123 1.2152 0.0656 6.9959 5.7842 5.3786 9.8067 1.3568 8.4636 2.3389 32.6592 23.4228 6.0106 6.4132 0.3510 16.3992 9.3049 7.9541 2.0983 68.8692 11.2638 22.9555 104.0674 2.5097 0.3076 0.6533 4.1682 4.9788 18.9194 0.6813 25.1830 21.0861 267.1738 80.0649 526.0917 177.2390 7.6508 69.1929 5.8089 0.2390 43.9088 94.8117 63.2608 4.9068 49.3774 16.8221 14.9488 23.9898 18.8906 19.4117 76.3803 4.6493 40.4685 220.8149 103.9174 17.9563 33.5908 4.8965 13.7705 25.6873 10.1172 13.5506 27.4224 12.6621 6.3607 1.0265 3.0420 4.5900
temp: 298.150 k
press: 1.00000 atm
elementType: 8 8 8 8 7 6 6 6 6 6 6 6 6 6 6 6 1 1 1 1 1 1 1 1 1 1 1 1 1
symmnumber: 1
zpe: 586639.0 jmol-1
zpe.correction: 0.223439 hartree
zpe.thermalcorrener: 0.239608 hartree
zpe.thermalcorrenthalpy: 0.240552 hartree
zpe.thermalcorrgfe: 0.176527 hartree
zpe.sumelectzpe: -781.331505 hartree
zpe.sumelectthermal: -781.315336 hartree
zpe.sumelectthermalent: -781.314392 hartree
zpe.sumelectthermalfe: -781.378417 hartree
dipole: -7.0734 -3.3465 0.4478
dipole: 7.8379
quadrupole: -132.1807 -93.1114 -93.1154
quadrupole: 23.8860 -2.6796 0.6723
quadrupole: -26.0449 13.0244 13.0204 23.8860 -2.6796 0.6723
hfenergy: -781.5549438 hartree
pointgroup: C01 [X(C11H13N1O4)]
dipole: 2.7730898 1.3207642 0.2730303 debye
polarizability: 242.2835375|0.7168508|139.4473496|-7.4960063|11.3508314|75.203919 unknown
InChI: InChI=1S/C11H13NO4/c1-9(13)3-2-8-16-11-6-4-10(5-7-11)12(14)15/h4-7H,2-3,8H2,1H3
charge 0 multiplicity 1
29 atoms
O  0.667508 -0.740637 -0.117932
O  5.727734 -1.038441 -0.667382
O  -5.323867 1.419328 0.475614
O  -5.679077 -0.818461 0.193607
N  -4.899466 0.209958 0.291642
C  3.039932 -0.300599 -0.166135
C  4.167586 0.743892 -0.066525
C  1.664774 0.349157 -0.014187
C  5.566006 0.147918 -0.280875
C  -0.681567 -0.422569 -0.007752
C  -1.185372 0.891622 0.19684
C  -1.573777 -1.525241 -0.113696
C  6.746409 1.067167 0.011549
C  -3.446627 -0.008943 0.188108
C  -2.573653 1.09539 0.294458
C  -2.956056 -1.322867 -0.016069
H  3.171623 -1.072745 0.612659
H  3.101242 -0.824092 -1.13589
H  4.157024 1.264832 0.91373
H  4.033118 1.544473 -0.826266
H  1.477724 1.09291 -0.816438
H  1.557307 0.848091 0.971262
H  -0.512174 1.748613 0.280005
H  -1.153502 -2.522432 -0.27112
H  6.545833 2.105813 -0.307021
H  6.929249 1.089843 1.104143
H  7.65589 0.688797 -0.480569
H  -2.993371 2.092594 0.451243
H  -3.66335 -2.152373 -0.093505
