program: Gaussian 09
title: 000269618
version: EM64L-G09RevD.01
frameworkgroup: C1[X(C13H10OS)]
method: RPBEPBE
basis: SDD
operation: Freq
keyword: #p
keyword: freq=noraman
keyword: PBEPBE/SDD
title: #p freq=noraman PBEPBE/SDD
converged: YES YES NO NO
title: Mulliken charges:
elementType: S O C C C C C C C C C C C C C H H H H H H H H H H
charge: 0.267102 -0.254693 0.290304 0.104780 -0.110364 -0.341010 -0.349352 -0.284026 -0.130782 -0.247030 -0.231649 -0.292274 -0.228272 -0.131908 -0.516118 0.215900 0.281027 0.211469 0.280260 0.251949 0.228647 0.232332 0.232248 0.250047 0.271412
chargesum: 0.00000
title: Mulliken charges with hydrogens summed into heavy atoms:
elementType: S O C C C C C C C C C C C C C
charge: 0.267102 -0.254693 0.290304 0.104780 -0.110364 -0.125110 -0.068325 -0.072557 0.149478 -0.018383 0.000683 -0.040325 0.003976 0.118138 -0.244705
polarizability: 3.43617047e+02 8.55483430e+00 1.63927526e+02 -5.24058390e-01 -1.34485660e-01 5.92711010e+01
1716.lowfreq: -6.9695 -2.7314 -0.0018 -0.0010 0.0003 4.2024 10.3810 30.5405 57.3399
frequency: 9.7259 30.5374 57.3364 93.9702 117.4488 170.3874 187.5726 212.4069 288.6230 295.4886 399.7077 402.9717 438.8877 476.7530 489.3398 561.6350 566.7630 613.9057 638.4801 678.9404 688.8325 695.2473 707.0941 724.9753 791.2097 822.8373 829.8954 852.8854 869.4365 875.7214 916.1296 940.8933 988.7381 989.3212 998.2629 1006.6689 1012.8938 1029.4433 1045.7382 1082.9878 1087.8623 1138.6825 1172.4523 1189.4286 1219.0002 1244.2303 1294.7926 1313.3205 1340.2552 1355.1821 1386.1251 1433.0099 1451.7483 1479.3076 1512.9065 1530.9227 1586.7203 1607.6633 1619.2564 3100.7892 3127.3059 3137.5741 3147.8502 3155.4357 3161.7012 3169.9561 3171.1266 3189.5123 3239.3805
redmass: 4.1393 6.5676 5.5021 5.5934 3.4916 6.3511 3.5602 6.9470 3.4927 6.6131 2.8559 6.9667 3.5531 4.4932 5.7942 9.4420 2.9083 6.4231 7.2222 3.9535 6.8488 1.5366 1.1848 7.0473 1.9686 4.7230 1.3403 1.3038 4.7974 1.9387 1.3767 1.4511 1.5161 4.2543 1.1884 4.0973 1.3444 2.0641 1.8095 1.2913 1.4998 1.7051 1.0646 1.1296 2.3549 1.4061 1.4007 1.7900 1.6369 2.5645 9.1331 2.3386 6.3352 2.2509 9.1246 5.3946 6.1806 5.9294 5.8924 1.0893 1.0850 1.0883 1.0924 1.0929 1.0932 1.0986 1.0915 1.0975 1.0997
irintensity: 0.3672 0.9462 0.2713 0.3764 0.0596 1.0777 0.0981 0.2323 1.6568 9.8018 0.0242 0.3849 0.1262 9.1929 5.2016 30.3625 4.4155 0.6124 25.2422 18.8512 10.3087 88.2417 63.0321 17.5785 54.4357 17.5787 13.1436 3.9207 5.4767 15.1328 0.0001 0.6930 5.8301 1.8829 31.6561 87.1767 2.3649 6.6497 8.1718 15.8233 5.1126 3.4199 8.0453 43.4939 168.3948 13.2320 7.2095 271.9374 162.3033 2.9770 4.2752 3.3260 73.2589 0.1945 240.3877 2.1968 46.3661 76.8045 235.6071 0.1830 0.6873 9.8581 11.1941 9.3590 40.2216 15.1105 12.8380 6.2985 0.7576
temp: 298.150 k
press: 1.00000 atm
elementType: 16 8 6 6 6 6 6 6 6 6 6 6 6 6 6 1 1 1 1 1 1 1 1 1 1
symmnumber: 1
zpe: 491447.4 jmol-1
zpe.correction: 0.187182 hartree
zpe.thermalcorrener: 0.200233 hartree
zpe.thermalcorrenthalpy: 0.201178 hartree
zpe.thermalcorrgfe: 0.144275 hartree
zpe.sumelectzpe: -973.603651 hartree
zpe.sumelectthermal: -973.590600 hartree
zpe.sumelectthermalent: -973.589656 hartree
zpe.sumelectthermalfe: -973.646558 hartree
dipole: 0.9722 4.1445 0.0554
dipole: 4.2573
quadrupole: -68.3698 -91.3477 -101.3593
quadrupole: 0.1905 -0.1189 -0.1870
quadrupole: 18.6558 -4.3221 -14.3337 0.1905 -0.1189 -0.1870
hfenergy: -973.7908333 hartree
pointgroup: C01 [X(C13H10O1S1)]
dipole: 0.4374553 -1.6122403 0.1217616 debye
dipolederiv: 0.1865418 -0.0085201 0.000552 -0.0780639 -0.2589902 0.0255744 0.0064446 0.026221 0.1433364 -0.9402614 -0.0632862 0.0052556 0.4112734 -0.9291821 0.0453222 -0.024291 0.0476988 -0.3385757 -0.7702681 -0.2190733 0.0149659 -0.2836467 -0.1516016 0.0105567 0.0260292 0.0142636 0.0023415 2.6982366 0.1213457 -0.0062752 -0.5298524 0.891969 -0.053379 0.0326322 -0.0590459 0.1738271 -0.2672471 0.3170218 -0.0212037 0.8516451 0.0788945 -0.0113677 -0.0542331 -0.0142824 -0.1574575 0.0374786 -0.0524963 0.0133944 0.2043489 0.0185977 -0.0176344 -0.0061166 -0.0181839 -0.1327509 0.1059817 0.1255638 -0.0114865 -0.1588981 0.0368145 -0.0207724 0.0133204 -0.0155177 -0.1101969 -1.9297074 0.2447116 -0.0221905 0.0034772 0.0262076 -0.0113691 -0.0094064 -0.012834 -0.2126963 1.235318 -0.1973926 0.0183267 -0.1460771 0.1151752 -0.0098861 0.0111894 -0.0093852 -0.0223497 -0.2687276 0.0082757 -0.0025964 0.1016356 0.1432202 -0.0363425 -0.0186897 -0.0369595 -0.1568893 0.0120492 -0.1752747 0.0259565 -0.2975789 -0.0846392 -0.0129917 0.0385874 -0.0126636 -0.1540982 0.2853967 0.0153962 0.00122 -0.3748579 -0.1326654 -0.0011565 0.0260811 0.0002115 -0.1313953 0.0648093 0.0557325 -0.001124 0.0709963 0.0374834 -0.0202073 -0.0046582 -0.0206349 -0.1382922 -0.5064102 -0.1061248 0.0056218 -0.3952597 -0.0492248 -0.0077528 0.0241584 -0.0064007 -0.1383904 -0.3216147 -0.0894283 0.0058542 0.4808287 0.2690407 -0.0354323 -0.0318508 -0.0381682 -0.3041031 -0.0241022 0.1039035 -0.0182219 0.1440022 0.0363555 0.0156668 -0.0208466 0.0145574 0.1425424 0.1870202 -0.0319901 0.0036343 0.0256128 -0.0016294 0.0205165 0.0025265 0.0176005 0.1525608 0.1104981 0.0095207 -0.0009971 0.0206463 -0.0917671 0.0149757 -0.0030186 0.015783 0.1605364 0.1252247 -0.0040453 -0.0000661 -0.0139177 0.013635 0.0082894 0.001226 0.0094991 0.1508856 0.0480145 -0.0844868 0.0048767 -0.1020729 0.0220126 0.0102721 0.0059759 0.0107993 0.1871333 0.064142 -0.010703 -0.000664 -0.0635495 -0.1195948 0.0336082 0.005217 0.0339747 0.1562599 -0.0975747 0.0861086 -0.0154117 0.1056337 0.0243504 0.0183516 -0.0177983 0.018509 0.1551364 -0.1076307 -0.0834242 0.0046474 -0.091845 0.056285 0.0107041 0.0069464 0.0106125 0.1572746 0.0599531 0.0434083 -0.0033844 0.0999365 -0.0413133 0.0158905 -0.0070991 0.015743 0.1950265 0.0128796 -0.0047428 -0.0006839 0.0155832 0.0905665 0.0085636 -0.0023259 0.0086028 0.2203346 unknown
polarizability: 343.9815949|-2.3179634|162.7303477|1.8139218|-9.2368573|60.1037312 unknown
InChI: InChI=1S/C13H10OS/c14-13(11-5-2-1-3-6-11)9-8-12-7-4-10-15-12/h1-10H
charge 0 multiplicity 1
25 atoms
S  4.394199 1.17753 -0.1176
O  -0.837686 2.186002 -0.229524
C  -2.195192 0.198223 -0.076617
C  -0.868421 0.911916 -0.129787
C  2.902049 0.133593 -0.056787
C  -2.331537 -1.207361 0.09039
C  -3.37089 0.989709 -0.195911
C  0.386562 0.124114 -0.068708
C  1.603584 0.764355 -0.103588
C  -3.610952 -1.802769 0.136024
C  -4.646841 0.396228 -0.152616
C  3.270216 -1.215905 0.032812
C  -4.771738 -1.004761 0.01369
C  4.684993 -1.440426 0.054402
C  5.432852 -0.26882 -0.018031
H  -1.450952 -1.849291 0.191637
H  -3.245962 2.070441 -0.320329
H  0.333721 -0.966574 -0.002201
H  1.561346 1.861238 -0.174384
H  2.536054 -2.023801 0.081719
H  -3.70308 -2.886594 0.267114
H  -5.543334 1.018708 -0.247182
H  -5.763607 -1.46932 0.048392
H  5.139978 -2.431289 0.121105
H  6.514738 -0.149045 -0.020721
