program: Gaussian 09
title: 000269610
version: EM64L-G09RevD.01
frameworkgroup: C1[X(C8H7F3O3S)]
method: RPBEPBE
basis: SDD
operation: Freq
keyword: #p
keyword: freq=noraman
keyword: PBEPBE/SDD
title: #p freq=noraman PBEPBE/SDD
converged: NO YES NO NO
title: Mulliken charges:
elementType: S F F F O O O C C C C C C C C H H H H H H H
charge: 1.022193 -0.165571 -0.163147 -0.163568 -0.437580 -0.480807 -0.477331 0.321936 0.406805 -0.420126 -0.399491 -0.361636 -0.170561 0.266040 -0.717912 0.289204 0.269971 0.257552 0.241487 0.297306 0.297760 0.287475
chargesum: 0.00000
title: Mulliken charges with hydrogens summed into heavy atoms:
elementType: S F F F O O O C C C C C C C C
charge: 1.022193 -0.165571 -0.163147 -0.163568 -0.437580 -0.480807 -0.477331 0.321936 0.406805 -0.130922 -0.129520 -0.104084 0.070926 0.266040 0.164629
polarizability: 1.67466438e+02 1.32249184e+01 1.31933134e+02 5.53130414e-01 5.79170140e-01 7.96473525e+01
1716.lowfreq: -54.6377 -23.6562 -7.4626 -0.0020 -0.0017 0.0012 1.6519 6.7706 28.8543
frequency: -54.5994 -23.0383 28.7395 65.1162 114.9429 140.9404 143.0077 176.9019 187.8251 222.4863 235.3153 263.0908 298.6517 316.6857 333.0501 360.4418 372.7562 424.0603 472.6597 497.0513 551.2666 560.5533 593.7632 610.1578 611.8112 679.9087 698.8284 793.6201 839.7698 852.2331 854.8602 911.1797 919.0621 979.3657 980.8676 991.7386 993.3837 1010.4760 1042.8655 1063.2483 1100.1131 1170.2300 1183.9167 1280.3775 1312.2311 1317.6864 1387.5906 1412.0847 1415.9099 1427.6252 1472.3943 1591.7768 1608.7163 3041.9101 3150.5152 3162.8673 3174.4656 3186.7068 3191.2483 3201.8367
redmass: 6.6501 17.4510 6.6352 9.6862 7.4786 7.5048 1.0267 5.6370 4.3210 5.4072 7.7180 6.0142 6.6984 10.4645 9.1845 10.6065 9.5920 4.3094 5.7802 13.4389 7.3497 9.0397 9.4315 12.1484 5.9805 2.2230 9.2777 1.3537 12.4425 2.7449 2.8499 1.3857 2.7278 1.4342 5.1703 7.0803 1.3599 5.6768 2.0198 3.7600 1.7172 2.4970 1.1711 3.5069 1.3628 1.1303 8.6526 1.0521 1.0595 2.9096 2.5625 6.8691 6.0497 1.0245 1.0876 1.0934 1.0934 1.0980 1.1082 1.1080
irintensity: 0.2862 0.0308 5.3160 1.3646 0.1047 5.8727 0.0011 0.7395 1.5215 1.5471 0.3760 4.5614 0.8225 17.5129 25.0913 15.7807 80.8979 0.6260 4.1417 3.3403 2.8493 38.4540 76.6149 14.2619 0.7181 19.3396 17.6853 70.8752 53.3143 93.4179 110.5833 6.3618 27.4791 27.0896 18.6310 181.7212 22.4814 173.9165 70.3895 57.0634 1.9892 123.1109 16.9815 309.3253 43.7048 3.6352 19.2976 14.5760 9.4150 130.4298 6.7890 32.1149 39.4951 1.3342 5.7915 2.3585 2.9725 4.3110 0.1978 0.3043
temp: 298.150 k
press: 1.00000 atm
elementType: 16 9 9 9 8 8 8 6 6 6 6 6 6 6 6 1 1 1 1 1 1 1
symmnumber: 1
zpe: 364758.7 jmol-1
zpe.correction: 0.138929 hartree
zpe.thermalcorrener: 0.152636 hartree
zpe.thermalcorrenthalpy: 0.153580 hartree
zpe.thermalcorrgfe: 0.097692 hartree
zpe.sumelectzpe: -1231.018536 hartree
zpe.sumelectthermal: -1231.004830 hartree
zpe.sumelectthermalent: -1231.003885 hartree
zpe.sumelectthermalfe: -1231.059774 hartree
dipole: -5.0966 5.3120 -0.2294
dipole: 7.3651
quadrupole: -72.0675 -91.3346 -102.2501
quadrupole: 2.5260 1.1251 0.1215
quadrupole: 16.4833 -2.7839 -13.6994 2.5260 1.1251 0.1215
hfenergy: -1231.1574653 hartree
pointgroup: C01 [X(C8H7F3O3S1)]
dipole: -2.094548 -2.0016551 0.0514803 debye
dipolederiv: 1.8366218 -0.3437894 0.0083001 -0.7917137 1.6066229 -0.0116529 -0.0042263 -0.0040811 1.2737755 -0.8912755 0.0816063 -0.0052296 -0.0143879 -0.3761339 -0.0008464 -0.0021346 0.0006973 -0.2825582 -0.378917 -0.0768502 -0.0218488 -0.1880031 -0.6155929 0.2715766 0.0181662 0.2478457 -0.6118801 -0.3771965 -0.0732871 0.0208455 -0.1830398 -0.6005388 -0.2751376 -0.0171734 -0.2438922 -0.6241538 -1.76274 0.5946979 -0.0077208 0.5949638 -0.6644205 0.0067577 0.083706 -0.0255156 -0.3113062 -0.5939954 0.0483809 0.0077932 0.1007494 -0.5382879 -0.0460587 0.0671855 -0.1454144 -0.5548853 -0.5829806 0.0466225 -0.0116198 0.1253158 -0.5242835 0.0404571 -0.0931655 0.1481271 -0.5750947 -0.1361515 -0.2664749 -0.0098123 -0.196485 -0.1115906 0.0021605 -0.0001177 -0.0048838 -0.1374555 1.6530997 -0.6947193 0.0076385 0.0814183 -0.1105351 0.0111112 -0.0538205 0.0248677 0.0772648 -0.3153558 0.2224414 0.0030253 -0.2997029 0.0224049 -0.0010743 0.0232385 -0.0044178 -0.1027224 -0.1022746 -0.0259971 -0.005181 0.058669 -0.1266565 -0.0023256 0.0025823 -0.0010185 -0.1387583 -0.382852 0.213817 -0.006204 0.1509738 0.0318392 0.0030746 -0.0413146 0.0213781 -0.1526316 0.1049589 -0.0272787 0.0004282 0.0190436 0.1099015 0.0095006 0.0188162 -0.0058759 -0.1186438 1.7382537 0.2471401 0.010329 0.5513838 1.6565572 0.006209 0.0033456 -0.0004796 1.5128492 -0.0880726 -0.0026191 -0.0004251 0.0056734 -0.0832574 -0.0006442 0.0077817 -0.0028776 -0.0970499 0.0826267 0.0538386 0.0041938 0.0540966 0.0370819 -0.0033543 -0.0123482 -0.0014572 0.1368333 -0.0086476 0.0309218 0.002257 0.0250253 0.109904 -0.0013598 -0.0033729 0.0017598 0.1693219 0.0418874 -0.0952752 -0.0006188 -0.087183 0.0500558 -0.0040827 -0.0074461 0.0003839 0.1653015 0.0378597 0.0741667 0.0011581 0.0455307 -0.0739489 -0.0056016 0.004856 -0.005257 0.1574742 0.0562547 -0.021851 0.0086575 -0.0223484 0.0778576 -0.0497911 0.04123 -0.0460672 0.0477269 0.0508187 -0.0203073 -0.0058767 -0.0267212 0.0900123 0.0448324 -0.0392352 0.0413143 0.038351 0.0180778 0.0348162 -0.0000893 -0.0032584 0.0330087 0.0062493 0.0034469 0.0048641 0.1282417 unknown
polarizability: 166.2578776|-14.7197427|133.132975|0.3440836|0.836993|79.6560724 unknown
InChI: InChI=1S/C8H7F3O3S/c1-15(12,13)14-7-4-2-3-6(5-7)8(9,10)11/h2-5H,1H3
charge 0 multiplicity 1
22 atoms
S  -2.918197 0.870874 -0.05572
F  3.895437 0.483613 0.035959
F  2.394379 1.75687 -1.089512
F  2.382017 1.733464 1.171787
O  -2.128631 -0.882017 0.040819
O  -2.579751 1.698739 1.289854
O  -2.631968 1.521766 -1.506259
C  1.576863 -0.250941 0.016479
C  -0.726272 -1.02413 0.017017
C  0.192997 0.04598 0.037218
C  2.046025 -1.58089 -0.018985
C  -0.275884 -2.369385 -0.021497
C  1.106701 -2.63594 -0.035945
C  2.546064 0.898846 0.033417
C  -4.658426 0.117838 0.026615
H  -0.141418 1.087196 0.073496
H  3.119402 -1.78582 -0.033082
H  -1.012503 -3.177727 -0.037805
H  1.452249 -3.674138 -0.063625
H  -4.739381 -0.543064 -0.845449
H  -4.702417 -0.428134 0.977337
H  -5.352787 0.968499 -0.012817
