program: Gaussian 09
title: 000269609
version: EM64L-G09RevD.01
frameworkgroup: C1[X(C11H10O5S)]
method: RPBEPBE
basis: SDD
operation: Freq
keyword: #p
keyword: freq=noraman
keyword: PBEPBE/SDD
title: #p freq=noraman PBEPBE/SDD
converged: NO YES NO NO
title: Mulliken charges:
elementType: S O O O O O C C C C C C C C C C C H H H H H H H H H H
charge: 1.026169 -0.246293 -0.433208 -0.196723 -0.478680 -0.478756 0.232072 0.215016 0.408867 0.403610 -0.351127 -0.470847 -0.411581 -0.479894 -0.808383 0.127889 -0.717764 0.248278 0.298684 0.254063 0.254430 0.240597 0.240605 0.242355 0.296820 0.296817 0.286982
chargesum: 0.00000
title: Mulliken charges with hydrogens summed into heavy atoms:
elementType: S O O O O O C C C C C C C C C C C
charge: 1.026169 -0.246293 -0.433208 -0.196723 -0.478680 -0.478756 0.232072 0.215016 0.408867 0.403610 -0.102849 -0.172163 -0.157519 -0.225463 -0.084826 0.127889 0.162855
polarizability: 2.64504578e+02 1.66347546e+01 1.80391921e+02 -6.98652011e-03 5.55969848e-03 9.19035460e+01
1716.lowfreq: -48.8014 -4.5248 -1.4364 -0.0015 -0.0013 0.0015 2.4459 24.1826 67.1088
frequency: -48.7790 24.1430 67.1078 82.0034 93.4244 155.3452 158.4780 167.7199 175.7030 192.8894 207.1690 243.9345 267.7222 271.6281 279.9300 314.9184 335.5755 373.2225 419.2050 436.2001 454.2448 501.4588 542.6344 546.5952 560.9074 586.7548 616.8883 665.9236 666.0709 704.1839 732.8207 764.5936 786.3166 807.9903 842.3451 842.8677 875.2240 920.7190 946.8422 953.9517 993.5855 998.0337 1043.3354 1047.2885 1050.9724 1117.0586 1133.0620 1159.8522 1225.1604 1248.2331 1272.4622 1316.5745 1377.7411 1383.7730 1403.2716 1413.4386 1416.6857 1425.0012 1468.7258 1470.9079 1488.7385 1544.9636 1604.9854 1614.7128 1692.5836 2982.6313 3041.5965 3059.4487 3103.7606 3151.4694 3172.6582 3177.3089 3182.4368 3190.8228 3202.2765
redmass: 7.8677 6.2157 7.9980 4.3632 10.0396 1.0274 7.3175 1.6170 3.6744 5.1633 1.7831 5.5150 6.4546 5.4446 4.1218 7.1193 7.0209 8.9834 8.1475 2.9765 8.8919 6.6268 4.0111 7.0645 5.8177 8.6828 4.0557 7.5947 3.7901 5.9689 3.0843 7.8082 6.7681 1.5303 12.1296 1.7066 1.3820 2.6390 1.3259 3.4761 1.4233 1.7192 2.0671 1.5704 4.0881 2.8376 2.1309 1.8240 3.4584 1.6992 1.3620 1.1305 2.5155 4.3590 1.3394 1.0525 1.0569 4.7996 1.0452 1.1054 3.3915 7.7992 7.1575 7.1993 10.5549 1.0383 1.0245 1.0970 1.0984 1.0884 1.0921 1.0931 1.0961 1.1081 1.1082
irintensity: 0.3434 4.8738 1.9530 0.5824 0.1418 0.0064 2.0889 0.0011 3.2685 1.5075 0.8013 0.0479 3.0247 7.2405 2.3983 11.2263 32.2703 74.7100 12.4315 6.7581 32.8725 39.3174 1.3449 28.7142 73.3517 49.6671 2.4451 5.4819 4.5059 27.3341 3.0634 63.7606 22.8299 24.3712 44.8795 29.7496 35.2715 30.0089 0.1035 205.6882 56.2975 12.7799 64.0298 8.6478 62.1351 65.8966 74.7539 59.8910 52.2544 60.9184 2.3432 2.6673 89.7095 53.0192 61.8796 14.5032 16.9660 9.3212 17.2017 9.4610 15.2349 4.0819 208.3845 265.1452 521.4415 12.4234 1.5200 12.6844 21.4084 4.5917 1.7281 2.1412 5.6838 0.2333 0.2604
temp: 298.150 k
press: 1.00000 atm
elementType: 16 8 8 8 8 8 6 6 6 6 6 6 6 6 6 6 6 1 1 1 1 1 1 1 1 1 1
symmnumber: 1
zpe: 495022.0 jmol-1
zpe.correction: 0.188544 hartree
zpe.thermalcorrener: 0.204496 hartree
zpe.thermalcorrenthalpy: 0.205440 hartree
zpe.thermalcorrgfe: 0.144733 hartree
zpe.sumelectzpe: -1197.947152 hartree
zpe.sumelectthermal: -1197.931200 hartree
zpe.sumelectthermalent: -1197.930256 hartree
zpe.sumelectthermalfe: -1197.990963 hartree
dipole: 3.3300 8.6630 -0.0063
dipole: 9.2810
quadrupole: -74.1793 -115.8799 -113.4004
quadrupole: -8.8325 -0.0408 -0.0050
quadrupole: 26.9739 -14.7267 -12.2472 -8.8325 -0.0408 -0.0050
hfenergy: -1198.1356954 hartree
pointgroup: C01 [X(C11H10O5S1)]
dipole: 1.4757978 3.3399128 -0.0011085 debye
polarizability: 265.9325247|12.4324784|178.9639526|0.0426843|0.0342877|91.9035671 unknown
InChI: InChI=1S/C11H10O5S/c1-7-5-11(12)15-10-6-8(3-4-9(7)10)16-17(2,13)14/h3-6H,1-2H3
charge 0 multiplicity 1
27 atoms
S  3.772993 -0.683223 0.00162
O  -1.499351 -1.567955 -0.001008
O  2.695531 0.908409 -0.000049
O  -3.462167 -2.783054 -0.001857
O  3.596766 -1.464027 1.403808
O  3.595278 -1.468084 -1.398123
C  -1.550179 0.896648 0.000027
C  -0.837405 -0.340674 -0.000481
C  -3.009305 0.86226 -0.000039
C  1.290999 0.809334 0.000023
C  -0.779854 2.094847 0.000513
C  0.571839 -0.400822 -0.000516
C  0.61998 2.066701 0.000553
C  -3.653382 -0.361226 -0.000584
C  -3.800056 2.151629 0.000451
C  -2.961781 -1.64378 -0.001012
C  5.358936 0.362017 -0.000731
H  -1.289234 3.06349 0.000915
H  1.051714 -1.382721 -0.001102
H  1.211213 2.985818 0.000985
H  -4.744842 -0.42632 -0.000745
H  -3.564889 2.76516 -0.889535
H  -3.565042 2.764392 0.891009
H  -4.883458 1.95229 0.000272
H  5.316803 0.96646 -0.915468
H  5.317733 0.969156 0.912262
H  6.188154 -0.359123 -0.000089
