program: Gaussian 09
title: 000269612
version: EM64L-G09RevD.01
frameworkgroup: C1[X(C11H9ClO3S)]
method: RPBEPBE
basis: SDD
operation: Freq
keyword: #p
keyword: freq=noraman
keyword: PBEPBE/SDD
title: #p freq=noraman PBEPBE/SDD
converged: NO YES NO NO
title: Mulliken charges:
elementType: Cl S O O O C C C C C C C C C C C H H H H H H H H H
charge: -0.020714 0.982060 -0.369111 -0.512605 -0.511089 0.229447 0.548259 0.133883 -0.375550 -0.358072 -0.330770 -0.383041 -0.217194 -0.232500 -0.225138 -0.747997 0.276893 0.258025 0.262014 0.261800 0.239266 0.236627 0.285570 0.287349 0.282588
chargesum: 0.00000
title: Mulliken charges with hydrogens summed into heavy atoms:
elementType: Cl S O O O C C C C C C C C C C C
charge: -0.020714 0.982060 -0.369111 -0.512605 -0.511089 0.229447 0.548259 0.133883 -0.375550 -0.081180 -0.072744 -0.121027 0.044606 0.006765 0.011489 0.107511
polarizability: 3.46734296e+02 2.81709503e+00 1.98856935e+02 7.38109035e-01 4.58086895e+00 9.28031333e+01
1716.lowfreq: -9.3348 -4.4666 0.0022 0.0028 0.0037 6.1991 19.2396 29.8398 43.1865
frequency: 18.8718 29.6164 43.1537 92.1342 113.3058 124.3362 128.5787 150.5825 178.3795 207.3413 235.1305 248.1885 299.4131 310.4877 344.7726 371.0583 385.4861 429.3243 466.9258 478.6608 509.0610 545.3515 565.4968 598.2658 632.1119 655.0943 716.4556 780.4931 782.1857 786.7156 810.8275 835.9656 888.7207 896.4793 918.2867 946.9912 971.1116 979.4916 1004.4132 1014.5081 1026.5225 1051.9674 1125.1564 1155.9251 1175.5175 1199.2029 1222.9748 1270.9980 1305.9655 1349.0998 1369.5927 1404.6133 1412.7726 1417.5173 1429.3753 1435.3781 1499.9282 1547.1427 1562.3063 1617.5774 3038.9055 3139.1596 3153.6642 3164.3653 3167.4880 3176.4739 3183.3703 3187.3311 3197.6708
redmass: 8.4845 6.1776 8.0568 8.5314 4.8595 3.0886 3.8666 1.3099 4.6262 9.2548 5.6165 5.3451 8.7665 9.2645 10.6349 10.4206 5.0310 3.7570 4.0049 5.9955 5.9094 6.0928 8.0639 3.5697 6.5719 3.6111 6.2933 5.1301 1.5534 2.3203 10.6081 1.6210 3.3382 1.6465 6.0136 1.4043 1.2772 1.3713 1.3517 1.6961 2.7564 2.8394 1.8780 1.5673 1.1283 1.6940 2.7697 1.8370 1.1338 3.1593 2.5845 7.2944 1.0549 1.0550 3.1891 2.3319 3.7124 6.1083 7.2787 6.3548 1.0245 1.0861 1.0897 1.0889 1.0949 1.1000 1.0972 1.1078 1.1074
irintensity: 1.6827 3.2377 3.9746 14.1405 13.9140 1.4884 3.0009 1.8841 8.4095 1.3895 31.0883 15.6358 5.7205 68.0533 29.8551 5.1508 10.2084 5.2218 0.4644 1.0024 3.2389 2.7852 64.9765 1.5374 17.2405 5.4312 3.4372 1.4475 79.0213 15.3921 63.8468 38.3517 28.6648 4.3364 67.2617 0.9715 70.7275 1.5494 0.5711 36.0246 5.5957 1.7592 12.4803 7.5575 14.4148 38.0987 85.6024 2.2015 4.9304 20.3242 20.7144 35.3345 15.0679 8.2847 9.5071 2.0182 128.9649 2.7160 103.4541 4.9282 0.0198 4.6420 6.8210 1.2976 5.6875 20.9204 1.7013 0.0696 0.1114
temp: 298.150 k
press: 1.00000 atm
elementType: 17 16 8 8 8 6 6 6 6 6 6 6 6 6 6 6 1 1 1 1 1 1 1 1 1
symmnumber: 1
zpe: 451481.0 jmol-1
zpe.correction: 0.171960 hartree
zpe.thermalcorrener: 0.187798 hartree
zpe.thermalcorrenthalpy: 0.188742 hartree
zpe.thermalcorrgfe: 0.126358 hartree
zpe.sumelectzpe: -1507.060907 hartree
zpe.sumelectthermal: -1507.045069 hartree
zpe.sumelectthermalent: -1507.044125 hartree
zpe.sumelectthermalfe: -1507.106509 hartree
dipole: -0.1038 -0.2088 -3.2163
dipole: 3.2247
quadrupole: -93.0689 -97.4643 -115.3900
quadrupole: 9.0640 13.1615 2.7642
quadrupole: 8.9055 4.5101 -13.4156 9.0640 13.1615 2.7642
hfenergy: -1507.232867 hartree
pointgroup: C01 [X(C11H9Cl1O3S1)]
dipole: -0.0672914 0.0276184 -1.2666161 debye
dipolederiv: -0.8458466 0.4718137 -0.053509 0.4031308 -0.3806829 0.0279594 -0.1736266 0.1010748 -0.0551562 1.7198088 -0.1394774 -0.0597889 0.1284739 0.9581896 -0.0159924 -0.2515867 0.0952619 1.1649315 0.5647627 -0.2634646 -0.2252716 -0.5737595 -0.2112266 0.1277792 -0.3996368 0.088993 -0.3491749 -0.823209 0.0066041 0.068299 -0.4474346 -0.3829995 0.1754639 0.4235394 -0.0426056 -0.5682563 -0.8548446 0.1499991 0.0484238 0.5185479 -0.6775133 -0.1653539 0.3921851 -0.1586143 -0.5479485 0.0610008 -0.1594412 -0.0631428 0.3920021 0.0168038 -0.0542816 0.0907208 -0.0446669 -0.0020923 -0.1680547 0.2564244 -0.0404494 0.2873311 -0.3567267 -0.0274514 -0.0524889 0.039612 0.0688641 -0.2801271 0.1568098 0.1664857 0.6895011 0.0366508 -0.1326969 -0.2545553 0.0913944 0.0823645 1.3612485 -0.6702228 0.1384301 -0.1687477 0.6840639 -0.060949 0.3634863 -0.1316165 -0.0466854 -0.2070966 -0.0876484 0.0532569 -0.3568902 -0.0879899 0.028559 -0.0729254 -0.0074812 -0.0929538 0.3803782 -0.0398823 0.0533111 -0.668482 0.0720885 0.1022852 0.1343492 -0.0493092 -0.0923516 0.0058406 0.0315621 0.0439573 -0.245131 0.0379213 0.0039989 0.0274372 0.0221314 -0.1340321 -0.9742138 0.1389992 0.0214278 -0.1519854 0.0064444 0.0180181 -0.2558579 0.033825 -0.069556 0.2231081 -0.0604791 -0.0087009 -0.0712469 0.1887991 0.0073016 0.0831041 0.0232521 -0.1360584 0.0615623 0.1165766 0.0786778 0.2622392 -0.0971628 0.0179632 0.0769334 0.0355662 -0.1171852 -0.3434506 0.0557765 -0.0373327 0.0016153 -0.0724534 -0.0021246 0.1631247 -0.0513091 -0.116295 0.0131189 0.0805142 -0.0288206 0.011303 0.0808807 -0.0040563 0.009141 -0.0117232 0.1243347 -0.0057948 -0.0557109 -0.0455421 -0.0263883 0.0616084 -0.0091537 -0.0029914 -0.0117696 0.1255067 0.0156566 0.0226986 -0.0350146 0.0956465 0.0677449 0.0124399 -0.0400344 -0.0007709 0.1507998 0.0844904 0.0215951 -0.0076392 0.0288525 -0.0359964 -0.0110861 -0.0288967 0.0013193 0.1590329 0.0911702 0.0141246 -0.01173 -0.0169577 -0.1012036 -0.0087085 -0.0146716 -0.018518 0.150757 -0.0563106 -0.0916129 -0.0502483 -0.0980546 0.028858 -0.0273842 -0.0571498 -0.0341153 0.1423341 -0.0928033 0.0379196 0.0343063 0.0174856 0.1164066 -0.015434 -0.0946635 0.0133905 0.0455127 0.0380595 -0.0248146 -0.0121838 -0.0376674 0.0455815 0.0534114 -0.0139663 0.051688 0.0444731 0.031546 0.0313369 -0.027202 0.0266163 0.0019138 -0.0405072 -0.0509698 -0.0350086 0.0688345 unknown
polarizability: 337.2358667|-36.3294588|207.0555818|-1.8680822|13.0012191|94.1029159 unknown
InChI: InChI=1S/C10H6ClO.CH3O2S/c11-9-5-6-10(12)8-4-2-1-3-7(8)9;1-4(2)3/h1-6H;1H3
charge 0 multiplicity 1
25 atoms
Cl 3.449716 -2.541923 0.249282
S  -3.080769 0.654644 0.542616
O  -1.67227 0.314761 -1.026245
O  -3.161496 -0.696396 1.454796
O  -2.981723 2.119714 1.254859
C  0.658449 0.478222 -0.318223
C  1.90879 -0.197207 -0.032291
C  -0.51868 -0.305377 -0.668002
C  1.911599 -1.631907 -0.096022
C  0.600683 1.900147 -0.240258
C  -0.449299 -1.720528 -0.672319
C  3.060548 0.584643 0.302318
C  0.77147 -2.38487 -0.401581
C  1.739468 2.640655 0.099032
C  2.975082 1.978597 0.367689
C  -4.554039 0.682742 -0.669597
H  -0.351929 2.395363 -0.449675
H  -1.354003 -2.29038 -0.902815
H  4.005951 0.074625 0.50984
H  0.824876 -3.476517 -0.423197
H  1.683609 3.732416 0.161368
H  3.860464 2.567587 0.629128
H  -5.44867 0.874156 -0.060825
H  -4.340654 1.493052 -1.378636
H  -4.563673 -0.302421 -1.152142
