program: Gaussian 09
title: 000269617
version: EM64L-G09RevD.01
frameworkgroup: C1[X(C11H9BrO3S)]
method: RPBEPBE
basis: SDD
operation: Freq
keyword: #p
keyword: freq=noraman
keyword: PBEPBE/SDD
title: #p freq=noraman PBEPBE/SDD
converged: YES YES NO NO
title: Mulliken charges:
elementType: Br S O O O C C C C C C C C C C C H H H H H H H H H
charge: 0.026250 1.000353 -0.396984 -0.507768 -0.501080 0.416409 0.381860 0.311476 -0.507209 -0.380097 -0.358466 -0.387050 -0.345141 -0.195733 -0.222419 -0.742613 0.267931 0.245529 0.259311 0.251458 0.263465 0.256493 0.285072 0.291247 0.287705
chargesum: 0.00000
title: Mulliken charges with hydrogens summed into heavy atoms:
elementType: Br S O O O C C C C C C C C C C C
charge: 0.026250 1.000353 -0.396984 -0.507768 -0.501080 0.416409 0.381860 0.311476 -0.239278 -0.134568 -0.099155 -0.135591 -0.081677 0.060760 -0.222419 0.121411
polarizability: 4.43617309e+02 -5.17499880e+00 1.57632977e+02 -5.91841551e+00 6.08172231e+00 9.44299753e+01
1716.lowfreq: -7.1808 -0.0019 -0.0016 -0.0001 3.1406 6.0249 13.7711 25.9643 31.6233
frequency: 12.3975 25.7860 31.5587 71.2629 125.4962 133.8478 148.1995 152.0167 176.9941 186.8331 237.9020 244.5795 268.5101 319.2620 339.0768 362.1603 392.6992 417.4618 447.5941 474.2426 502.9573 518.5005 558.6791 585.2029 634.0334 668.1861 731.2900 767.3759 783.3152 813.3645 821.1975 830.9646 891.2242 898.1968 902.3465 910.7089 953.2804 971.9439 980.1350 981.5979 1023.7841 1060.1309 1118.8813 1151.1445 1162.6819 1224.7985 1250.3191 1271.9083 1309.8001 1323.4446 1383.3995 1405.7012 1412.4034 1418.9019 1432.0064 1440.4075 1490.2759 1555.6852 1581.6716 1615.7967 3040.6420 3137.1448 3141.5319 3156.1952 3158.1133 3172.4457 3177.1800 3189.2829 3198.6077
redmass: 6.8333 6.1457 7.9800 10.1094 5.0463 3.0597 1.5292 3.9039 5.4929 4.4106 9.5646 5.1278 8.2900 8.3811 6.9869 9.0447 3.9451 4.8012 4.9734 2.5441 7.6770 6.8373 3.9024 7.2572 7.2394 3.4545 6.9946 2.6302 5.0165 1.3565 5.8949 1.6872 5.4890 3.1913 1.6343 1.6439 3.6626 1.3829 1.3379 1.3320 1.7887 2.3730 1.7080 1.2597 1.7574 1.9739 1.7936 1.7463 1.1325 1.8130 3.5819 5.9606 1.0543 1.0527 9.6444 2.0970 3.8393 6.8254 6.4411 6.8810 1.0246 1.0893 1.0897 1.0928 1.0924 1.0967 1.0962 1.1079 1.1074
irintensity: 0.8876 4.7426 1.3388 10.0275 2.5394 2.5408 7.2132 14.3323 3.9420 1.4249 41.9672 21.5956 3.4805 28.6602 3.3065 41.5352 3.4050 10.1530 4.6910 22.2633 1.5820 1.7692 9.4141 80.5458 2.7948 9.6770 8.9778 0.9846 25.1460 47.9841 31.7420 22.3556 49.6639 26.7527 22.4531 48.0788 0.4800 1.7909 39.4805 41.9680 40.2589 55.0567 41.2116 6.7598 16.0526 10.2928 1.3482 7.5023 5.4826 2.5457 6.2566 19.5945 16.0850 8.5534 9.0193 69.3039 27.8717 3.1107 25.7129 171.4675 0.2547 6.5327 3.6311 3.2949 0.7867 5.3846 5.4660 0.0253 0.0058
temp: 298.150 k
press: 1.00000 atm
elementType: 35 16 8 8 8 6 6 6 6 6 6 6 6 6 6 6 1 1 1 1 1 1 1 1 1
symmnumber: 1
zpe: 450254.5 jmol-1
zpe.correction: 0.171493 hartree
zpe.thermalcorrener: 0.187483 hartree
zpe.thermalcorrenthalpy: 0.188427 hartree
zpe.thermalcorrgfe: 0.124359 hartree
zpe.sumelectzpe: -1060.458732 hartree
zpe.sumelectthermal: -1060.442743 hartree
zpe.sumelectthermalent: -1060.441798 hartree
zpe.sumelectthermalfe: -1060.505866 hartree
dipole: -1.2198 -0.5277 -3.3100
dipole: 3.5668
quadrupole: -95.8977 -101.9520 -119.0424
quadrupole: 4.8337 15.3268 2.9729
quadrupole: 9.7330 3.6787 -13.4117 4.8337 15.3268 2.9729
hfenergy: -1060.6302251 hartree
pointgroup: C01 [X(C11H9Br1O3S1)]
dipole: 0.4331045 0.8781677 -1.0052369 debye
dipolederiv: -1.0577195 -0.1166361 0.0587787 -0.2435559 -0.0799786 0.0036021 0.091757 -0.001532 -0.0336589 1.5644409 0.0394703 0.0541645 0.2505651 1.1149434 -0.0258382 0.4789561 -0.0492558 1.2411907 0.6307788 -0.0299074 0.1892318 -0.1850496 -0.3511623 0.0092474 0.411257 0.0135969 -0.3657708 -0.5455452 -0.0470905 0.0239364 -0.3546188 -0.5010062 -0.1452559 -0.5962405 -0.06029 -0.6590348 -1.0752107 0.065883 -0.0810781 0.5280278 -0.5611997 0.1433145 -0.3729783 0.0329047 -0.5017733 -0.328307 -0.1171057 -0.0677907 -0.1134942 -0.1014016 -0.0598323 0.0614603 -0.0440165 0.0386503 0.5607781 -0.067125 -0.0392836 0.0830822 -0.0272692 -0.0443189 -0.0639715 -0.0149726 0.0358497 -0.465133 0.0838029 -0.0873011 0.2044032 0.1884889 0.0886219 0.4631469 0.0369814 0.0871286 0.5655754 0.095968 0.0615989 -0.2196803 -0.0206313 -0.0756079 -0.2249241 0.0624171 -0.1330991 -0.4335771 0.0712272 -0.0352839 0.0872898 0.0999066 0.1098363 0.0907464 0.0944434 -0.0830441 0.0899659 -0.0659672 -0.0551248 0.2508195 -0.0188255 0.1222733 -0.0628967 0.0482438 -0.082293 0.2074623 0.1220033 0.0075605 -0.2098404 0.0522948 0.0729373 -0.1409777 0.0702065 -0.0998718 -0.9151257 0.0518262 0.0576119 0.1960214 0.0053479 0.0661268 0.2312036 0.0313675 -0.0932718 -0.4748452 -0.2214273 -0.0458203 -0.2092587 -0.0647861 0.0269263 -0.031038 0.0601518 -0.0805088 1.7502958 0.2796744 -0.1258397 0.2107734 0.1440203 0.0483362 -0.2673593 0.0624163 -0.07678 -0.3229906 -0.0308025 0.0099208 -0.0515743 -0.1028933 0.0150462 -0.2287177 0.0094743 -0.1068249 0.0486605 -0.0273333 0.0059471 -0.0368616 0.0145214 -0.039161 -0.0393939 -0.0695359 0.1062373 0.0398867 -0.0847814 -0.0280074 -0.0544093 -0.0351128 -0.0815418 0.0189606 -0.0653119 0.1222876 0.0298369 0.0651359 0.0606754 0.0242347 0.0562341 -0.0490974 0.0181896 -0.0475928 0.1191356 0.0410801 -0.0845311 -0.0123082 -0.0191849 -0.0205167 -0.0658806 0.0128873 -0.062001 0.1242513 0.0699373 -0.0176519 0.0055245 -0.0691089 -0.0039875 -0.0624539 -0.0142091 -0.0665042 0.130805 0.0152189 0.0644931 0.0484557 0.0606635 0.0548629 -0.056393 0.0531577 -0.0611839 0.1284115 -0.0702563 -0.0292254 -0.0532486 -0.1111571 0.0964166 0.0115584 0.0577174 0.0285812 0.0507073 0.069031 -0.0220848 0.033633 -0.0415238 0.0515342 -0.03869 0.0239973 -0.0399167 0.0295688 0.0057615 0.0221849 0.0140472 0.0234375 0.0101996 0.0262442 0.0292694 0.0313284 0.1017076 unknown
polarizability: 443.3280977|11.257995|146.4565792|3.5547573|25.2697429|105.8955849 unknown
InChI: InChI=1S/C10H6BrO.CH3O2S/c11-9-3-1-8-6-10(12)4-2-7(8)5-9;1-4(2)3/h1-6H;1H3
charge 0 multiplicity 1
25 atoms
Br -5.728931 -0.515387 0.442526
S  3.727201 0.157778 0.787513
O  2.506103 0.390064 -0.848885
O  3.091831 1.004871 2.023818
O  4.217997 -1.374238 1.023099
C  -1.094717 0.633752 0.048377
C  -1.563666 -0.658347 -0.418695
C  1.185224 0.044785 -0.664351
C  0.287239 0.961358 -0.078696
C  -0.619952 -1.581457 -0.991952
C  0.724626 -1.248309 -1.104566
C  -2.039589 1.545646 0.629179
C  -2.950392 -0.987614 -0.293993
C  -3.389269 1.21032 0.745527
C  -3.828476 -0.064635 0.275046
C  5.126437 1.151588 -0.028789
H  0.667211 1.925285 0.276057
H  -0.977579 -2.557703 -1.338118
H  1.456511 -1.939279 -1.534124
H  -1.689136 2.519408 0.988923
H  -3.309313 -1.960043 -0.645087
H  -4.10585 1.90647 1.189352
H  5.951841 1.173465 0.696134
H  5.380615 0.608307 -0.947918
H  4.707235 2.144518 -0.233576
