program: Gaussian 09
title: 000269613
version: EM64L-G09RevD.01
frameworkgroup: C1[X(C11H9NO5S)]
method: RPBEPBE
basis: SDD
operation: Freq
keyword: #p
keyword: freq=noraman
keyword: PBEPBE/SDD
title: #p freq=noraman PBEPBE/SDD
converged: YES YES NO NO
title: Mulliken charges:
elementType: S O O O O O N C C C C C C C C C C C H H H H H H H H H
charge: 1.019625 -0.363863 -0.490014 -0.492027 -0.188642 -0.206627 0.013401 0.255099 0.443094 0.149072 0.162631 -0.434628 -0.317030 -0.343178 -0.420801 -0.243103 -0.228898 -0.747905 0.248812 0.269520 0.274616 0.251038 0.239850 0.238925 0.290196 0.334580 0.286259
chargesum: 0.00000
title: Mulliken charges with hydrogens summed into heavy atoms:
elementType: S O O O O O N C C C C C C C C C C C
charge: 1.019625 -0.363863 -0.490014 -0.492027 -0.188642 -0.206627 0.013401 0.255099 0.443094 0.149072 0.162631 -0.185817 -0.047510 -0.068562 -0.169763 -0.003253 0.010028 0.163130
polarizability: 3.51296094e+02 -4.48708935e+00 1.81038584e+02 -7.83855170e+00 5.36819809e+00 9.92773329e+01
1716.lowfreq: -5.4819 0.0001 0.0012 0.0013 7.3390 10.0858 32.3607 38.5401 64.7919
frequency: 32.3191 38.4890 64.7871 85.0014 90.9924 113.2365 132.7968 155.0086 169.3602 193.8307 199.2136 220.6623 249.1455 291.0454 318.9384 327.8203 355.9196 374.8047 403.5730 426.5502 440.4078 488.4523 520.6346 536.5169 565.2622 593.9518 631.8816 654.9439 709.7453 720.2242 741.4763 766.1022 791.2009 831.7616 839.1673 845.5749 886.6794 914.9392 947.9610 965.6955 986.2313 987.8436 999.6114 1015.1826 1038.9973 1041.5052 1142.6922 1155.6619 1182.0601 1210.8886 1223.0546 1239.0361 1279.2571 1308.1942 1329.8163 1364.0416 1399.7169 1405.3493 1407.0071 1427.4150 1430.0972 1444.6795 1501.8134 1555.2125 1590.9095 1622.3276 3032.7875 3133.3853 3140.9463 3146.8911 3165.7563 3173.9914 3183.5814 3184.0915 3193.7442
redmass: 7.0058 6.6134 7.1675 9.0781 8.9654 6.2293 7.4655 1.4233 2.1424 4.5864 8.0177 6.5357 4.2289 10.8276 8.5599 9.4516 7.4690 6.7262 5.9955 4.3225 7.3207 4.3598 6.8131 3.4971 8.0436 6.0087 6.2947 4.8636 5.2090 6.5455 8.1912 1.3318 3.6914 6.8450 5.6682 1.7122 1.5983 3.1592 8.0524 1.3556 1.2630 1.3905 1.3681 4.7591 2.2675 1.8255 1.8426 1.2817 1.1713 4.4170 4.1177 2.0378 1.8648 1.1514 3.1853 5.4181 4.3391 1.5639 1.9112 1.1082 3.1377 2.1875 3.3006 7.5840 6.1133 6.2315 1.0238 1.0872 1.0893 1.0906 1.0968 1.0969 1.0969 1.1080 1.1084
irintensity: 3.6306 3.5287 6.9862 0.5664 1.3000 1.8603 3.9417 0.0988 0.0675 3.2700 1.8119 10.7841 0.9239 2.8203 54.6178 10.1218 13.5733 17.6485 7.6441 6.9789 0.8427 11.7313 0.6118 1.1890 23.7932 16.6173 7.6923 3.9297 4.6311 3.8189 9.5270 55.3923 1.1279 47.0050 2.7522 71.5130 15.7651 30.2278 3.2806 1.1626 93.0240 0.9181 0.6783 2.9363 2.1622 55.3404 1.4621 0.9463 3.9440 59.5157 154.0621 8.6810 10.5875 1.9346 25.1822 103.5512 22.4779 6.0519 21.0459 10.6166 6.2846 1.4001 19.9281 0.9130 7.7743 9.2716 1.9524 0.6667 4.9571 13.4510 24.3416 3.3487 11.4227 1.2016 6.0765
temp: 298.150 k
press: 1.00000 atm
elementType: 16 8 8 8 8 8 7 6 6 6 6 6 6 6 6 6 6 6 1 1 1 1 1 1 1 1 1
symmnumber: 1
zpe: 480180.1 jmol-1
zpe.correction: 0.182891 hartree
zpe.thermalcorrener: 0.199873 hartree
zpe.thermalcorrenthalpy: 0.200817 hartree
zpe.thermalcorrgfe: 0.137228 hartree
zpe.sumelectzpe: -1251.960126 hartree
zpe.sumelectthermal: -1251.943144 hartree
zpe.sumelectthermalent: -1251.942200 hartree
zpe.sumelectthermalfe: -1252.005789 hartree
dipole: -2.8145 -0.4784 -0.0222
dipole: 2.8550
quadrupole: -87.7628 -111.2365 -119.2298
quadrupole: 17.7328 -4.0796 5.0265
quadrupole: 18.3135 -5.1601 -13.1534 17.7328 -4.0796 5.0265
hfenergy: -1252.1430169 hartree
pointgroup: C01 [X(C11H9N1O5S1)]
dipole: -1.1123549 -0.1523324 0.0332994 debye
polarizability: 350.2989226|-10.6556987|181.8675358|-13.3492554|-1.1500741|99.4455521 unknown
InChI: InChI=1S/C10H6NO3.CH3O2S/c12-9-6-5-7-3-1-2-4-8(7)10(9)11(13)14;1-4(2)3/h1-6H;1H3
charge 0 multiplicity 1
27 atoms
S  3.485209 -0.658277 0.235057
O  2.02219 -0.429292 -1.201157
O  2.783939 -0.658788 1.695865
O  4.416281 -1.900085 -0.226587
O  -0.337635 2.632826 -1.189538
O  1.452816 2.031718 0.080382
N  0.347773 1.758812 -0.529729
C  -1.534462 0.131677 -0.125329
C  -1.964243 -1.254145 -0.043217
C  -0.158056 0.374114 -0.460564
C  0.747962 -0.67828 -0.759037
C  -1.035329 -2.30882 -0.33773
C  0.278198 -2.034017 -0.694039
C  -2.485623 1.164845 0.177359
C  -3.312324 -1.549517 0.33329
C  -3.790858 0.83828 0.550833
C  -4.213962 -0.524841 0.627803
C  4.381633 0.977896 -0.129201
H  -1.384297 -3.34591 -0.28222
H  0.989077 -2.82727 -0.943955
H  -2.190643 2.213697 0.099997
H  -3.623638 -2.598617 0.390986
H  -4.502412 1.638102 0.780669
H  -5.243466 -0.759401 0.917187
H  4.690819 0.905329 -1.180338
H  3.631242 1.760327 0.03915
H  5.232505 1.017034 0.565763
