program: Gaussian 09
title: 000269587
version: EM64L-G09RevD.01
frameworkgroup: C1[X(C8H9ClN2O2)]
method: RPBEPBE
basis: SDD
operation: Freq
keyword: #p
keyword: freq=noraman
keyword: PBEPBE/SDD
title: #p freq=noraman PBEPBE/SDD
converged: YES YES NO NO
title: Mulliken charges:
elementType: Cl O O N N C C C C C C C C H H H H H H H H H
charge: -0.042547 -0.277218 -0.252119 0.032460 -0.633406 0.292462 -0.428205 -0.249129 0.202095 -0.222960 0.153391 -0.261424 -0.671594 0.264593 0.289685 0.232710 0.232516 0.214701 0.232566 0.232575 0.335704 0.323142
chargesum: 0.00000
title: Mulliken charges with hydrogens summed into heavy atoms:
elementType: Cl O O N N C C C C C C C C
charge: -0.042547 -0.277218 -0.252119 0.032460 0.025441 0.292462 -0.163611 0.040556 0.202095 0.242266 0.153391 -0.261424 0.008248
polarizability: 1.59489625e+02 6.32324446e+00 1.49584886e+02 -5.29879662e-02 -3.41713755e-02 5.59101561e+01
1716.lowfreq: -6.2738 -4.2603 -0.0026 -0.0015 -0.0011 6.4945 32.0555 65.9751 79.5824
frequency: 32.0130 65.9634 79.5811 88.3414 157.8963 187.5069 196.3165 214.2726 234.4215 250.2113 304.2784 343.0560 375.5426 402.8488 411.5300 502.3703 506.3893 524.1370 558.9520 616.2251 713.6265 722.4638 733.8846 798.8649 810.8100 852.2067 868.1658 902.2414 912.3481 969.0850 1012.2655 1025.0235 1095.1873 1113.7083 1135.7453 1164.2299 1214.4948 1249.5720 1301.2352 1350.8370 1358.2685 1402.2914 1424.8555 1459.5518 1462.9334 1473.1924 1485.9357 1538.2522 1600.4358 1618.5028 1626.6615 2997.8392 3012.7483 3071.9838 3094.4191 3109.9223 3166.0939 3217.3413 3556.0273 3709.2784
redmass: 3.5534 3.7878 4.8178 3.1812 3.8000 3.3004 6.2759 4.1870 4.5947 1.4584 5.5399 11.7885 4.0222 1.1641 5.4573 1.2939 3.7789 4.1966 6.4054 5.3177 10.1911 6.4525 3.1794 1.1028 4.1693 6.6503 1.4353 1.5881 5.4483 5.7210 1.7649 2.3564 1.7920 2.2545 1.4694 1.9676 2.8608 1.1317 2.4062 5.8962 1.4505 1.2668 3.9947 4.9189 1.0401 1.0691 1.0681 7.8843 2.3227 10.7091 1.9649 1.0359 1.0582 1.1067 1.0985 1.1027 1.0928 1.0942 1.0451 1.1049
irintensity: 1.7005 2.0925 1.2125 0.8045 0.3820 0.0205 3.7951 11.5740 4.0784 2.8909 7.6526 10.2821 8.3518 173.4962 2.0275 108.9650 42.2897 7.5611 1.5319 3.2332 30.1756 5.7368 26.2194 2.5535 0.0690 43.1845 14.4693 31.5516 19.6076 78.7081 21.1390 100.4610 76.1791 5.8004 6.0620 151.4666 270.6968 0.0281 76.3246 18.8129 9.8043 34.8835 97.3776 148.6158 12.7495 1.7757 15.0360 204.0489 28.0821 149.5559 463.9131 18.7307 17.6342 7.2095 28.3304 42.0352 3.9043 4.6357 118.2012 40.2179
temp: 298.150 k
press: 1.00000 atm
elementType: 17 8 8 7 7 6 6 6 6 6 6 6 6 1 1 1 1 1 1 1 1 1
symmnumber: 1
zpe: 426973.4 jmol-1
zpe.correction: 0.162626 hartree
zpe.thermalcorrener: 0.175686 hartree
zpe.thermalcorrenthalpy: 0.176630 hartree
zpe.thermalcorrgfe: 0.121844 hartree
zpe.sumelectzpe: -1029.318352 hartree
zpe.sumelectthermal: -1029.305292 hartree
zpe.sumelectthermalent: -1029.304348 hartree
zpe.sumelectthermalfe: -1029.359134 hartree
dipole: 1.5661 -2.2955 0.0169
dipole: 2.7789
quadrupole: -69.3605 -79.2591 -84.1025
quadrupole: 19.9057 -0.0491 -0.0730
quadrupole: 8.2135 -1.6850 -6.5285 19.9057 -0.0491 -0.0730
hfenergy: -1029.4809777 hartree
pointgroup: C01 [X(C8H9Cl1N2O2)]
dipole: 0.5183504 -0.9624686 0.0169914 debye
dipolederiv: -0.2031394 0.2379777 -0.0029421 0.2175222 -0.9262835 0.0114976 -0.002619 0.0113766 -0.0982912 -1.6204559 -0.3581011 0.0151933 -0.5919992 -0.6892619 0.0103178 0.0170806 0.0078466 -0.2700495 -0.7803308 0.2164299 0.0010797 -0.0406677 -0.9000179 0.0074614 0.004345 0.0064969 -0.3174431 -0.5878829 -0.2581116 0.0078764 -0.454783 -0.9645154 0.0157837 0.0114591 0.0150334 -0.2035145 -1.0865522 -0.7450002 0.0146637 -0.7410624 -0.7008924 0.0029287 0.0098635 -0.0005554 -0.7349694 -0.3069039 0.2849492 -0.0015108 0.1019457 0.4915996 -0.008218 0.0021649 -0.009719 0.0335082 -0.5499021 -0.6018301 0.0122886 0.2083207 -0.1981196 -0.0005067 0.0004004 0.0063491 -0.159524 -0.3832005 0.3845922 -0.0035887 -0.0095626 -0.6686229 0.0088688 0.0024616 0.0053481 -0.1197008 1.9172635 -0.0275267 -0.0136371 0.4878274 1.2864592 -0.0175327 -0.0211907 -0.0140212 0.2216754 1.0313973 0.155773 -0.0073765 0.06393 0.2561506 0.0008768 -0.0051231 0.000779 0.3550525 1.3215543 1.0438235 -0.0258117 0.8566853 0.8255485 -0.0157857 -0.0226964 -0.0174577 0.1932849 0.7200143 -0.3583698 -0.0005862 -0.165748 1.6832471 -0.0257781 -0.0031529 -0.024109 0.013783 -0.0800057 -0.09153 0.0018645 -0.0746984 -0.0460398 0.0010198 0.0016032 0.0011423 0.0579539 0.1282579 0.0304103 0.000018 0.0016919 -0.0119844 0.0026572 0.0007004 0.0021323 0.1757495 0.1080912 -0.0463788 0.001371 -0.0584789 0.075012 0.0020538 0.0013459 0.0020458 0.1783861 -0.0686773 -0.0355013 0.0052474 0.0424523 0.0051423 0.0916964 -0.0363479 0.0915964 -0.0558254 -0.0692136 -0.0367973 -0.0039202 0.0414376 0.0021249 -0.0935288 0.0359737 -0.0926523 -0.0543626 -0.1745132 0.0213777 0.002063 0.0403588 0.0709665 0.0000883 0.0018657 0.0002202 0.1181898 0.1185885 0.0443784 -0.0603626 -0.0138763 0.0131861 0.0891318 -0.0366052 0.1024422 -0.0603704 0.120031 0.0436725 0.0570339 -0.0145755 0.010458 -0.0899363 0.0342694 -0.1040359 -0.0590918 0.2721372 0.0482824 0.0005407 0.0070421 0.1636894 0.0039158 0.0023535 0.0041419 0.3920125 0.1734423 0.0474801 0.0004958 0.0962379 0.2221535 0.0029885 0.0018484 0.0055998 0.3935468 unknown
polarizability: 160.6895592|5.1404739|148.354981|-0.9521049|-1.4499162|55.9401276 unknown
InChI: InChI=1S/C8H9ClN2O2/c1-2-13-8(12)5-3-6(9)11-7(10)4-5/h3-4H,2,10H2,1H3
charge 0 multiplicity 1
22 atoms
Cl -2.224341 3.106659 -0.009601
O  2.295651 0.248756 -0.001735
O  1.750366 -2.01671 0.033719
N  -2.730204 0.449402 0.038499
N  -3.45955 -1.769705 0.07724
C  -0.026404 -0.340565 0.02586
C  -1.04204 -1.317332 0.049564
C  -0.35899 1.041165 0.00788
C  1.396331 -0.811853 0.019244
C  3.746294 -0.120808 -0.009117
C  -2.400735 -0.884485 0.056475
C  -1.733844 1.340689 0.015119
C  4.532016 1.18521 -0.023656
H  -0.771276 -2.376929 0.061526
H  0.409592 1.812627 -0.010408
H  3.949423 -0.732037 0.888621
H  3.936887 -0.744087 -0.90139
H  5.615555 0.967696 -0.029848
H  4.293028 1.780449 -0.921312
H  4.305655 1.792752 0.869016
H  -4.404662 -1.392593 0.079803
H  -3.31215 -2.774301 0.098501
