program: Gaussian 09
title: 000269649
version: EM64L-G09RevD.01
frameworkgroup: C1[X(C18H19ClN4O3)]
method: RPBEPBE
basis: SDD
operation: Freq
keyword: #p
keyword: freq=noraman
keyword: PBEPBE/SDD
title: #p freq=noraman PBEPBE/SDD
converged: YES YES NO NO
title: Mulliken charges:
elementType: Cl O O O N N N N C C C C C C C C C C C C C C C C C C H H H H H H H H H H H H H H H H H H H
charge: -0.029525 -0.288319 -0.224660 -0.220057 -0.291354 -0.468425 -0.274166 0.018304 -0.003414 -0.437255 -0.438440 -0.400973 -0.400606 -0.384485 0.293986 0.239464 -0.172299 0.458042 -0.106519 -0.303690 -0.192452 -0.414575 -0.301795 -0.348633 -0.367025 0.390981 0.257806 0.204784 0.223540 0.221648 0.207156 0.207670 0.207254 0.207187 0.207021 0.191711 0.207296 0.265613 0.425958 0.251487 0.265360 0.235122 0.313988 0.283604 0.283682
chargesum: 0.00000
title: Mulliken charges with hydrogens summed into heavy atoms:
elementType: Cl O O O N N N N C C C C C C C C C C C C C C C C C C
charge: -0.029525 -0.288319 -0.224660 -0.220057 -0.291354 -0.042467 -0.274166 0.018304 0.254393 -0.008931 -0.009636 0.013952 0.013602 0.014522 0.293986 0.239464 0.093314 0.458042 -0.106519 -0.052203 0.072908 -0.179453 0.012194 -0.065029 -0.083342 0.390981
polarizability: 4.42401575e+02 1.43835487e+01 2.80399107e+02 -5.18206942e-01 1.88848692e+00 1.23872314e+02
1716.lowfreq: -5.9583 -3.0759 -1.7397 -0.0007 0.0006 0.0012 11.8360 25.1461 39.9148
frequency: 11.2900 25.1384 39.9039 46.2918 60.3753 67.6220 76.5139 78.9444 95.7420 135.9765 160.0712 161.5709 181.5032 205.2311 212.2340 235.9609 244.2774 267.5119 312.6130 316.3883 338.6382 365.2293 373.6956 396.8015 417.3897 418.8106 429.8787 440.8607 466.5638 467.6160 483.9017 509.2801 510.6215 597.1065 621.0809 622.8649 652.6914 668.1529 698.5882 703.6666 713.0133 730.0412 740.7102 763.0908 784.4477 787.9606 807.0727 826.1195 833.1202 840.8583 843.1872 860.0550 876.6864 894.4172 902.1629 916.1686 946.1711 962.3056 979.1227 980.8335 997.6201 1001.4502 1008.4912 1042.3807 1054.7934 1071.9818 1073.9959 1090.3337 1097.7281 1100.5494 1110.2038 1111.9766 1117.2304 1152.5275 1166.8093 1177.8391 1201.2624 1226.6443 1239.3831 1250.3689 1260.6106 1275.3704 1293.7841 1298.5457 1310.0997 1312.2441 1332.6857 1334.5307 1337.0560 1338.3705 1348.0372 1351.8281 1369.4725 1371.4568 1396.1084 1431.4127 1437.5300 1455.5690 1463.1878 1464.5557 1470.4029 1473.3567 1484.7403 1489.7587 1539.1222 1571.6899 1588.8891 1597.6546 1622.0510 1658.8087 2726.8644 2965.4691 2975.8659 2977.1775 2995.1465 2996.4379 3021.2294 3036.5695 3036.7241 3043.3357 3055.0062 3064.4095 3139.0625 3148.6453 3177.1795 3184.6580 3198.7193 3203.2668 3244.6654
redmass: 6.0704 6.7856 6.1453 5.0054 5.6741 6.0380 4.4554 5.6992 6.2025 6.0410 8.8095 8.4314 4.9700 5.4866 2.0180 6.3357 4.1374 4.1762 3.7088 6.4075 2.5961 4.5137 8.6189 4.4644 3.0347 6.6568 3.0704 7.2914 3.5444 3.4622 1.9434 3.2106 7.0647 5.9267 7.3980 6.3665 5.1359 4.7757 6.5780 10.3230 6.4406 3.9554 4.6256 4.5800 1.4393 4.8012 1.2906 3.7920 1.3508 4.7902 1.8270 1.4403 1.5353 2.5174 1.5003 1.8906 1.3756 4.1076 3.7390 1.3374 3.4705 3.8965 1.3207 1.8656 4.1768 1.0486 1.5427 1.0975 3.0400 2.1410 2.6889 1.6551 1.3731 2.6326 3.1669 1.4205 1.6799 4.5935 1.5609 1.3318 1.2555 1.8726 1.6815 1.5227 2.5418 1.3354 1.3749 1.5541 2.9771 1.4444 1.4617 7.3601 1.6092 1.4568 6.6680 1.9828 3.6655 2.2357 1.1284 1.0880 1.0935 1.0866 1.1141 2.7291 6.2688 4.2584 6.9211 6.3212 5.8100 1.8157 1.0950 1.0651 1.0621 1.0619 1.0602 1.0617 1.0836 1.0985 1.0945 1.1018 1.1029 1.1003 1.0904 1.0913 1.0906 1.0948 1.0969 1.0954 1.0914
irintensity: 1.1515 0.0098 0.1144 0.3108 0.1344 2.5748 0.1453 1.1177 1.6541 0.8156 3.7405 3.1033 2.1599 0.1660 0.1509 3.1305 1.0031 7.7291 0.5526 0.0424 1.3084 2.4288 3.8102 2.7165 0.1777 25.7609 3.1899 9.9802 7.9941 7.5994 0.0239 12.4259 0.7497 2.9128 2.8150 8.2813 10.0453 26.2397 18.0519 2.9866 37.3688 1.1244 3.0041 3.3536 0.6333 29.8221 45.3490 5.8932 12.2141 26.1525 1.3246 20.5490 64.1258 15.5465 13.5135 0.1809 1.3026 8.9582 214.1532 3.4462 19.8926 103.3046 0.0989 1.3601 58.0861 0.0970 4.7323 64.5429 25.7670 84.5757 0.3429 33.6376 17.4523 50.2404 743.2874 66.9782 0.8548 560.6361 21.5375 19.2496 1.7691 30.2855 0.0023 2.6883 137.1607 2.8290 0.5295 18.3212 9.7123 0.4747 9.3692 114.1694 62.1526 41.7698 68.0736 79.7943 6.6801 142.4591 19.6931 6.4744 7.2037 10.8044 4.2037 40.8428 120.4754 876.0713 403.1324 633.6668 21.2693 566.7548 1314.8505 30.8086 30.0040 30.4851 26.1650 25.7526 79.1269 59.5416 56.5078 19.6196 0.5911 76.8373 13.8495 11.1358 1.3955 2.9907 1.0985 3.3002 0.2542
temp: 298.150 k
press: 1.00000 atm
elementType: 17 8 8 8 7 7 7 7 6 6 6 6 6 6 6 6 6 6 6 6 6 6 6 6 6 6 1 1 1 1 1 1 1 1 1 1 1 1 1 1 1 1 1 1 1
symmnumber: 1
zpe: 916752.7 jmol-1
zpe.correction: 0.349173 hartree
zpe.thermalcorrener: 0.371981 hartree
zpe.thermalcorrenthalpy: 0.372925 hartree
zpe.thermalcorrgfe: 0.294073 hartree
zpe.sumelectzpe: -1600.122373 hartree
zpe.sumelectthermal: -1600.099564 hartree
zpe.sumelectthermalent: -1600.098620 hartree
zpe.sumelectthermalfe: -1600.177472 hartree
dipole: 10.0109 2.0879 0.1006
dipole: 10.2268
quadrupole: -223.1461 -145.7898 -160.5223
quadrupole: -7.8875 -0.1705 0.2353
quadrupole: -46.6601 30.6963 15.9638 -7.8875 -0.1705 0.2353
hfenergy: -1600.4715453 hartree
pointgroup: C01 [X(C18H19Cl1N4O3)]
dipole: 3.7224827 -1.5205004 -0.1411221 debye
polarizability: 430.4743457|-44.1858433|287.4515955|-20.5660739|-20.561069|128.7470545 unknown
InChI: InChI=1S/C18H19ClN4O3/c19-13-10-11-20-17(12-13)22(15-4-2-1-3-5-15)18(24)21-14-6-8-16(9-7-14)23(25)26/h6-12,15,21H,1-5H2
charge 0 multiplicity 1
45 atoms
Cl 5.025032 -3.875938 0.34242
O  0.223013 2.008924 -0.213933
O  -7.122039 0.054424 0.75247
O  -6.730412 2.279569 0.421836
N  1.628823 0.114115 -0.074006
N  -0.760443 -0.087854 0.174068
N  0.79424 -2.097214 0.327108
N  -6.326432 1.055876 0.545302
C  2.755219 1.085364 -0.342751
C  3.69936 1.310597 0.867471
C  3.49642 0.840839 -1.682854
C  4.668382 2.47915 0.552673
C  4.466964 2.020182 -1.951546
C  5.439523 2.236631 -0.76711
C  1.870904 -1.260652 0.12681
C  0.312417 0.756848 -0.043843
C  3.193329 -1.808946 0.130226
C  -2.117858 0.271746 0.253971
C  3.347112 -3.183592 0.335572
C  0.981408 -3.428758 0.524432
C  2.246122 -4.042648 0.538838
C  -3.043236 -0.79317 0.481351
C  -2.608752 1.605321 0.124169
C  -4.418107 -0.544095 0.577231
C  -3.987409 1.855919 0.220474
C  -4.882681 0.785813 0.44529
H  2.213827 2.039733 -0.472801
H  4.296349 0.413931 1.11791
H  3.0895 1.549115 1.75921
H  2.751943 0.764571 -2.497843
H  4.074616 -0.101857 -1.68737
H  4.089456 3.421097 0.467256
H  5.374347 2.612033 1.394276
H  5.030844 1.830168 -2.884428
H  3.879785 2.946902 -2.113706
H  6.090517 1.344226 -0.656534
H  6.106746 3.093751 -0.9783
H  4.071781 -1.187857 -0.016478
H  -0.460475 -1.10904 0.286619
H  0.074258 -4.022222 0.676404
H  2.361373 -5.115791 0.699045
H  -2.668152 -1.817917 0.581022
H  -1.902596 2.417926 -0.049603
H  -5.13757 -1.34829 0.750615
H  -4.383947 2.870176 0.124138
