program: Gaussian 09
title: 000269584
version: EM64L-G09RevD.01
frameworkgroup: C1[X(C12H12N6O2S)]
method: RPBEPBE
basis: SDD
operation: Freq
keyword: #p
keyword: freq=noraman
keyword: PBEPBE/SDD
title: #p freq=noraman PBEPBE/SDD
converged: NO YES NO NO
title: Mulliken charges:
elementType: S O O N N N N N N C C C C C C C C C C C C H H H H H H H H H H H H
charge: 0.949345 -0.536585 -0.540805 -0.147901 -0.082845 -0.060759 -0.061199 -0.718403 -0.608852 -0.583251 0.519544 0.162743 -0.088094 -0.335093 -0.406742 -0.037596 -0.216755 -0.243958 -0.233769 0.169167 -0.367607 0.230108 0.268598 0.293683 0.242283 0.265089 0.284899 0.286045 0.245119 0.336405 0.337008 0.334862 0.345316
chargesum: 0.00000
title: Mulliken charges with hydrogens summed into heavy atoms:
elementType: S O O N N N N N N C C C C C C C C C C C C
charge: 0.949345 -0.536585 -0.540805 -0.147901 -0.082845 -0.060759 -0.061199 -0.044990 0.071325 -0.084544 0.519544 0.162743 -0.088094 -0.041410 -0.164459 -0.037596 0.048334 0.040941 0.052276 0.169167 -0.122488
polarizability: 2.55253567e+02 2.22615361e+01 1.95911277e+02 -6.25252192e+00 1.61573978e+01 1.54388519e+02
1716.lowfreq: -7.0655 -2.4960 0.0006 0.0018 0.0022 3.2831 17.3381 26.1773 28.5042
frequency: 17.2791 26.1616 28.3723 45.4044 70.2573 112.5347 118.5820 121.4006 168.2054 180.0377 188.5508 227.0945 257.5695 266.1561 273.3804 286.9732 312.4969 330.1777 365.9358 378.6705 408.9872 426.7802 472.7680 509.7599 513.5611 520.1716 540.3718 549.0181 555.6525 578.6944 619.3594 620.5096 649.0503 671.2117 697.3185 707.7711 762.2306 790.0870 792.6003 797.2685 813.7610 820.0627 848.8752 856.2741 875.3373 908.5886 929.7147 945.2393 958.7941 975.3527 997.1654 1001.0610 1023.2132 1055.0130 1072.0402 1109.5464 1133.6308 1171.5562 1187.5831 1205.4165 1224.1012 1237.8418 1295.3957 1299.5062 1316.7213 1327.8887 1355.7180 1370.4926 1381.2698 1388.4670 1407.4098 1433.2653 1454.4773 1469.3756 1477.5041 1535.2486 1544.9804 1578.6698 1597.1218 1598.3431 1632.5989 3020.1882 3081.0132 3132.5732 3134.0661 3162.4887 3164.8995 3165.8627 3228.5879 3364.5409 3532.0322 3538.4920 3693.5624
redmass: 6.1710 7.0905 7.0460 3.7793 6.1561 6.9134 3.7765 1.9048 5.9251 4.5800 7.6182 6.4429 3.6850 4.5721 2.8991 7.0969 3.3911 5.2202 6.3930 3.3240 2.8778 10.0658 3.5911 8.3139 4.2358 1.2435 3.6966 1.0727 3.6426 5.3356 4.8664 6.4898 4.9450 7.8779 6.0925 5.1743 4.0652 3.3681 1.9456 5.1304 3.2750 2.0729 5.8560 1.4424 1.6440 4.0740 1.4307 1.8693 2.4806 1.4188 4.8343 1.4243 4.4712 2.4857 1.4801 1.7586 1.7738 1.9589 1.1954 2.6741 2.3918 2.3183 5.5982 1.4155 4.5255 2.2853 1.4684 1.8948 5.0206 5.8167 2.6192 2.6525 1.6029 2.5185 1.9323 1.0852 6.9198 1.9044 6.3454 6.7898 2.7316 1.0597 1.1046 1.0898 1.0917 1.0948 1.0963 1.0921 1.0984 1.0414 1.1002 1.0443 1.1056
irintensity: 1.1107 0.1434 1.0390 1.2315 5.5722 5.6459 3.1866 32.2840 1.3413 1.8029 0.8820 15.9024 11.8058 4.3016 0.7798 3.9643 3.2630 8.1280 15.8715 0.3519 0.1705 48.2147 105.2442 0.5939 66.6401 280.0677 5.1834 0.4182 3.0136 12.4291 10.2342 2.6150 69.1288 0.0825 19.3754 5.4254 54.7800 3.6267 123.0927 20.1367 133.6045 4.7751 1.9984 3.5598 20.6740 56.5640 11.6062 13.2535 7.7339 0.8832 1.8229 2.9388 10.6417 32.8699 29.4072 13.4791 3.1554 25.7526 4.1391 3.1702 39.1547 24.9256 86.3967 9.6583 42.0972 73.5226 6.2965 23.0220 7.0991 10.0236 17.7181 54.6824 23.9948 14.9964 44.7041 23.5737 52.1006 38.7239 4.7144 1.0522 627.7756 23.6511 4.7760 10.0849 4.8629 1.0528 4.7431 15.1107 0.0339 27.8399 25.5638 133.6869 50.1354
temp: 298.150 k
press: 1.00000 atm
elementType: 16 8 8 7 7 7 7 7 7 6 6 6 6 6 6 6 6 6 6 6 6 1 1 1 1 1 1 1 1 1 1 1 1
symmnumber: 1
zpe: 627987.7 jmol-1
zpe.correction: 0.239188 hartree
zpe.thermalcorrener: 0.258348 hartree
zpe.thermalcorrenthalpy: 0.259292 hartree
zpe.thermalcorrgfe: 0.189152 hartree
zpe.sumelectzpe: -1339.831473 hartree
zpe.sumelectthermal: -1339.812313 hartree
zpe.sumelectthermalent: -1339.811368 hartree
zpe.sumelectthermalfe: -1339.881508 hartree
dipole: -3.2940 2.3875 2.9181
dipole: 5.0066
quadrupole: -148.9178 -120.8645 -125.7898
quadrupole: 0.2992 7.3997 -8.7933
quadrupole: -17.0604 10.9928 6.0676 0.2992 7.3997 -8.7933
hfenergy: -1340.0706605 hartree
pointgroup: C01 [X(C12H12N6O2S1)]
dipole: 1.2929588 -1.0430896 1.058335 debye
polarizability: 256.7355508|19.8358067|196.5078405|4.6598588|-14.2432578|152.309972 unknown
InChI: InChI=1S/C12H12N6O2S/c13-11-10-12(16-6-15-11)18(7-17-10)5-8-1-3-9(4-2-8)21(14,19)20/h1-4,6-7H,5,13-14H2
charge 0 multiplicity 1
33 atoms
S  -4.866799 0.802756 0.454611
O  -5.036476 2.220335 -0.329334
O  -5.976033 -0.390261 0.412039
N  1.673534 -1.288686 -0.392115
N  3.181988 -1.381825 1.339386
N  2.411843 0.831757 -1.460053
N  4.331132 1.8310 -0.287183
N  -4.618413 1.208654 2.23198
N  5.308099 0.8699 1.637766
C  0.550144 -1.640057 -1.286077
C  -0.783647 -1.043177 -0.844419
C  2.481083 -0.152645 -0.515997
C  3.406781 -0.231438 0.558982
C  -0.995006 0.357088 -0.948605
C  -1.818789 -1.876188 -0.35412
C  -3.213457 0.062239 -0.053861
C  2.137285 -1.981249 0.738904
C  -2.222496 0.925578 -0.549102
C  -3.055914 -1.327166 0.051293
C  4.362018 0.8243 0.650991
C  3.380559 1.779172 -1.269797
H  0.487927 -2.740766 -1.338508
H  0.821196 -1.261435 -2.287783
H  -0.194711 0.991911 -1.346767
H  -1.666364 -2.960075 -0.290714
H  1.6793 -2.911169 1.070523
H  -2.417611 1.99839 -0.644188
H  -3.878544 -1.953649 0.410205
H  3.394949 2.605361 -1.98675
H  -4.708334 2.232406 2.344487
H  -5.313408 0.674782 2.780527
H  5.96521 1.647273 1.655677
H  5.345859 0.133788 2.339702
