program: Gaussian 09
title: 000269675
version: EM64L-G09RevD.01
frameworkgroup: C1[X(C28H26ClN3O2)]
method: RPBEPBE
basis: SDD
operation: Freq
keyword: #p
keyword: freq=noraman
keyword: PBEPBE/SDD
title: #p freq=noraman PBEPBE/SDD
converged: YES YES NO NO
title: Mulliken charges:
elementType: Cl O O N N N C C C C C C C C C C C C C C C C C C C C C C C C C C C C H H H H H H H H H H H H H H H H H H H H H H H H H H
charge: -0.077166 -0.291607 -0.293118 -0.149273 -0.012604 -0.488124 0.468699 -0.398769 -0.397742 0.358451 -0.516621 -0.013689 0.295687 -0.062953 -0.359423 0.251637 -0.370678 0.122393 -0.435020 -0.104554 -0.656934 -0.655937 -0.817228 -0.392318 -0.395603 -0.229203 0.101783 -0.238258 0.502742 -0.441058 -0.367072 -0.038066 -0.191901 -0.263659 0.233173 0.229180 0.227916 0.227520 0.234489 0.237436 0.258713 0.310780 0.220356 0.239807 0.222731 0.219538 0.249911 0.221834 0.265247 0.251453 0.228806 0.285419 0.289194 0.231984 0.235312 0.376425 0.267533 0.311162 0.227353 0.253910
chargesum: 0.00000
title: Mulliken charges with hydrogens summed into heavy atoms:
elementType: Cl O O N N N C C C C C C C C C C C C C C C C C C C C C C C C C C C C
charge: -0.077166 -0.291607 -0.293118 -0.149273 -0.012604 -0.111699 0.468699 0.063584 0.057693 0.358451 -0.282132 -0.013689 0.295687 -0.062953 -0.121987 0.251637 -0.111964 0.122393 -0.124240 -0.104554 0.025961 0.035347 -0.071722 -0.106899 -0.106409 0.002782 0.101783 -0.002946 0.502742 -0.173525 -0.055910 -0.038066 0.035452 -0.009749
polarizability: 8.37019625e+02 1.22810920e+02 5.12371190e+02 1.84076228e+01 -7.22136811e+00 1.79061109e+02
1716.lowfreq: -7.6273 -2.7037 -1.5928 -0.0021 -0.0015 -0.0012 12.9352 15.7900 19.3687
frequency: 12.3383 15.7644 19.3181 34.4374 37.7861 49.1143 58.5951 70.5166 72.3668 85.0149 96.8852 99.3303 122.7798 137.6509 157.3573 172.7411 186.1906 189.0295 193.4033 194.6861 202.0286 212.8744 215.5671 232.1860 247.3635 262.9483 279.9347 296.3694 314.1587 343.8798 349.6455 356.1358 367.3093 386.1304 400.7637 414.0543 419.3209 433.3698 440.0966 444.0420 466.0360 471.2584 495.1125 496.9863 518.2737 542.1331 549.3202 570.0789 593.3690 595.8484 612.5013 644.2074 653.4980 667.6803 674.6862 682.7696 688.8531 714.7927 723.9471 747.7624 756.6376 781.7742 786.7443 788.2480 791.7256 795.5586 808.1968 825.0987 842.9373 853.1811 857.7060 861.2184 870.3676 911.0763 920.5725 925.2356 929.5566 934.5745 957.3218 969.7144 977.6728 990.0976 991.3435 994.3847 999.2927 1010.5546 1026.5708 1029.8664 1044.8891 1070.1399 1071.5880 1073.1124 1075.2124 1085.8159 1094.2121 1094.3416 1124.0204 1139.1814 1156.3604 1168.7775 1173.5288 1191.9850 1196.3973 1201.4829 1218.1882 1260.2504 1262.6313 1264.3878 1277.8499 1286.1303 1292.1603 1305.8219 1336.5800 1338.7478 1346.2305 1357.7710 1369.5306 1374.7033 1388.0853 1389.9090 1393.2307 1394.3094 1405.7731 1419.2998 1439.1716 1447.8286 1450.9245 1466.9223 1468.3930 1469.5216 1470.7327 1473.5992 1476.2837 1482.9641 1484.3780 1492.9659 1499.5137 1502.2009 1510.7742 1521.1782 1542.1512 1548.1155 1572.2852 1584.1082 1611.0107 1613.0309 1625.9314 1642.3471 2984.0145 2987.8669 2988.1311 3000.5335 3005.0933 3049.0024 3054.2955 3063.8218 3085.0293 3085.4091 3085.5220 3091.8288 3095.4668 3097.7265 3132.3687 3141.4331 3144.6923 3146.2604 3149.8519 3151.0895 3154.9198 3164.7476 3172.1762 3175.7351 3175.9289 3197.0124
redmass: 4.4302 8.3789 4.2810 5.3055 5.0714 6.4154 4.7061 4.9287 5.4095 2.9773 3.6405 5.2101 4.1030 5.1046 5.5988 3.6457 4.0991 3.4187 3.0170 1.8791 1.6872 2.0941 1.2410 3.6255 1.9983 6.4569 4.7450 3.8759 3.3419 7.3626 5.8746 4.6558 3.8628 4.9757 10.4666 5.8149 3.6138 3.4371 3.4825 3.3041 3.9048 7.9590 3.9932 5.8910 3.3403 3.2217 4.8490 5.1586 3.4476 5.8273 5.1557 3.9991 6.0017 7.0356 5.8160 5.4738 2.2956 6.0661 4.0185 4.6059 3.7285 1.6248 1.2015 1.3521 1.6367 2.4573 1.6916 3.5920 3.0826 1.6654 2.7113 4.9171 1.5311 1.3735 1.6660 2.2049 6.8033 2.4905 1.3447 1.1284 5.9415 1.4052 1.3379 1.3920 1.9750 1.3493 2.4802 2.0684 1.4970 2.1660 3.2318 2.2185 1.8122 2.7611 1.6729 1.6453 2.1006 1.8027 1.7435 1.1012 1.0864 2.3709 2.1299 2.9929 1.7728 1.5579 1.7472 1.7632 3.6178 1.2306 1.4680 1.6974 2.0737 1.4917 1.3647 3.3108 3.5859 4.9313 1.2111 2.0157 2.0957 2.3242 1.2064 3.5123 3.6480 3.0279 3.4070 1.0488 1.0519 1.3389 2.1625 2.8227 1.0988 1.0558 1.3765 1.2904 1.9082 5.0431 1.7189 2.2935 5.1816 4.3270 8.3689 5.1666 6.5962 6.8061 5.2157 2.1995 1.0377 1.0357 1.0356 1.0603 1.0609 1.1029 1.1023 1.0980 1.0947 1.0953 1.0956 1.0984 1.1013 1.1012 1.0862 1.0887 1.0900 1.0896 1.0906 1.0874 1.0929 1.0943 1.0991 1.0962 1.0954 1.0953
irintensity: 0.5884 0.1617 0.4365 1.6675 0.1407 0.2914 0.1501 0.9567 1.0676 0.2948 1.6149 0.9821 3.5983 1.5279 1.6801 1.6941 5.3167 4.7253 13.0206 7.3004 0.6501 2.2402 1.7069 4.8806 0.2474 0.3203 5.5984 0.4796 2.7442 27.1566 5.5524 9.6101 11.1884 36.1270 9.1408 24.2286 0.7069 14.5307 8.6429 18.8431 1.9091 26.6297 10.7834 57.1911 1.6372 10.6329 42.7823 0.1270 24.5509 16.3249 12.6204 56.4761 26.1181 27.2337 3.6376 1.2024 26.0398 3.0019 34.3109 16.2022 18.4863 28.5807 6.4516 73.5716 35.1086 1.9307 33.3854 13.5608 1.4259 39.7696 4.9294 45.3731 11.2251 3.5916 0.8545 1.7618 26.5125 4.3603 1.8734 104.4425 17.0659 2.4208 9.2652 2.4979 43.1679 0.1691 34.6678 24.8193 19.2314 53.7840 32.2480 11.2693 117.6311 77.9874 11.3869 17.2192 1.5162 1.5593 6.8177 4.0798 1.2349 19.9673 31.5880 63.0579 34.0621 293.3346 33.0206 29.8780 85.3710 1.9514 1.5270 16.1523 221.6834 26.4913 328.4004 28.6126 127.4985 23.2251 13.1045 23.8711 96.4457 511.1359 29.8368 97.6701 554.5430 13.0208 312.6945 6.7171 7.9502 29.4479 18.8684 332.9435 2.4454 0.4642 8.4701 41.7937 30.5948 112.3702 5.3103 80.6312 124.1352 244.1898 109.1801 787.6465 0.4725 116.3368 402.5160 120.0523 15.4222 45.6200 26.9522 45.0809 105.3665 4.6890 7.7295 11.4588 215.8606 238.1552 164.2719 5.3511 26.6250 74.7797 4.9090 10.3925 0.9060 21.0871 15.8884 2.5623 1.7750 3.7135 35.1718 32.2608 4.1659 9.2522
temp: 298.150 k
press: 1.00000 atm
elementType: 17 8 8 7 7 7 6 6 6 6 6 6 6 6 6 6 6 6 6 6 6 6 6 6 6 6 6 6 6 6 6 6 6 6 1 1 1 1 1 1 1 1 1 1 1 1 1 1 1 1 1 1 1 1 1 1 1 1 1 1
symmnumber: 1
zpe: 1241357.4 jmol-1
zpe.correction: 0.472808 hartree
zpe.thermalcorrener: 0.503848 hartree
zpe.thermalcorrenthalpy: 0.504792 hartree
zpe.thermalcorrgfe: 0.407508 hartree
zpe.sumelectzpe: -1854.973608 hartree
zpe.sumelectthermal: -1854.942569 hartree
zpe.sumelectthermalent: -1854.941625 hartree
zpe.sumelectthermalfe: -1855.038909 hartree
dipole: -12.1692 -2.1383 0.6605
dipole: 12.3732
quadrupole: -184.0399 -179.4423 -206.4424
quadrupole: 25.2697 3.2244 -2.3184
quadrupole: 5.9350 10.5326 -16.4675 25.2697 3.2244 -2.3184
hfenergy: -1855.4464165 hartree
pointgroup: C01 [X(C28H26Cl1N3O2)]
dipole: 4.7972867 0.8237383 -0.0706479 debye
polarizability: 829.2594889|132.3559449|502.4223224|-60.5258955|49.7748081|196.7701123 unknown
InChI: InChI=1S/C28H26ClN3O2/c1-4-32(5-2)21-13-14-25(18(3)15-21)31-26-17-24(27(33)23-12-7-6-11-22(23)26)28(34)30-20-10-8-9-19(29)16-20/h6-17,30H,4-5H2,1-3H3
charge 0 multiplicity 1
60 atoms
Cl -8.626867 1.860599 1.186297
O  -3.648881 -2.07988 0.131354
O  -1.600268 1.690939 0.192419
N  5.639559 2.294292 -0.204714
N  1.850851 -1.880767 -0.74446
N  -3.669509 0.565598 0.346837
C  4.717618 1.255196 -0.286218
C  6.611885 2.557052 -1.290154
C  5.681962 3.215954 0.953395
C  2.742952 0.046371 0.661217
C  3.732122 1.042474 0.734004
C  2.725168 -0.834064 -0.492998
C  -0.179253 -3.192651 -0.577109
C  0.530287 -1.897739 -0.490889
C  4.739039 0.318609 -1.377986
C  -1.590167 -3.240817 -0.347427
C  3.796815 -0.703702 -1.441801
C  -1.635816 -0.725929 -0.047531
C  -0.264152 -0.711096 -0.250497
C  -2.369926 -2.010703 -0.063787
C  7.917498 1.739754 -1.157369
C  4.676234 4.38487 0.839954
C  1.83563 -0.139475 1.869483
C  0.51917 -4.398498 -0.854561
C  -2.270613 -4.487696 -0.394337
C  -0.167592 -5.624272 -0.909117
C  -2.294819 0.620294 0.169036
C  -1.568517 -5.672092 -0.673209
C  -4.562513 1.635333 0.578998
C  -5.936532 1.294662 0.744871
C  -4.162498 3.000122 0.649525
C  -6.867955 2.316627 0.975021
C  -5.135128 3.994574 0.88279
C  -6.502984 3.674945 1.049775
H  6.132957 2.363942 -2.267029
H  6.848393 3.636978 -1.271203
H  5.510205 2.648795 1.886126
H  6.7103 3.616017 1.021459
H  3.733612 1.673997 1.627946
H  5.506569 0.377368 -2.153656
H  3.821087 -1.430805 -2.259505
H  0.215616 0.273182 -0.291259
H  8.428757 1.963487 -0.203731
H  7.714576 0.655278 -1.186071
H  8.609719 1.986355 -1.983193
H  4.87327 4.986546 -0.065402
H  3.638632 4.01407 0.781496
H  4.758993 5.049962 1.718955
H  0.965517 0.542089 1.848895
H  1.442891 -1.16757 1.937104
H  2.397023 0.072028 2.79702
H  1.598105 -4.339704 -1.023884
H  -3.349263 -4.489551 -0.209615
H  0.379606 -6.547042 -1.131853
H  -2.098218 -6.630017 -0.709678
H  -4.049847 -0.410483 0.31454
H  -6.258575 0.24972 0.692582
H  -3.108458 3.250369 0.520789
H  -4.824536 5.043832 0.935612
H  -7.253527 4.449173 1.229742
