program: Gaussian 09
title: 000269579
version: EM64L-G09RevD.01
frameworkgroup: C1[X(C11H16O4)]
method: RPBEPBE
basis: SDD
operation: Freq
keyword: #pfreq=noraman
keyword: PBEPBE/SDD
title: #p freq=noraman PBEPBE/SDD
converged: NO YES NO NO
title: Mulliken charges:
elementType: O O O O C C C C C C C C C C C H H H H H H H H H H H H H H H H
charge: -0.290589 -0.289936 -0.198422 -0.221887 0.202795 0.219087 -0.467459 -0.460464 -0.534941 -0.413376 -0.387189 0.169991 -0.329887 -0.352402 -0.292422 0.207178 0.257400 0.228965 0.220467 0.234454 0.271958 0.192909 0.213265 0.227465 0.205717 0.236681 0.221266 0.243446 0.230107 0.211233 0.244588
chargesum: 0.00000
title: Mulliken charges with hydrogens summed into heavy atoms:
elementType: O O O O C C C C C C C C C C C
charge: -0.290589 -0.289936 -0.198422 -0.221887 0.202795 0.219087 -0.002881 -0.011032 -0.028530 -0.007201 0.045993 0.169991 0.128060 0.121151 0.163400
polarizability: 1.25509391e+02 -4.78187801e+00 1.29597197e+02 -6.58265468e+00 3.15712688e+00 1.05621166e+02
1716.lowfreq: -22.0562 -17.3127 -0.0011 -0.0010 -0.0009 8.3090 47.8712 73.4381 98.0080
frequency: 47.8265 73.3284 97.9916 137.6062 157.0320 179.3723 187.0960 213.0296 245.1328 273.9159 307.1987 329.6202 352.2446 395.3065 445.3862 506.8140 524.8279 572.7143 643.7328 656.9122 665.0479 674.7526 699.9561 775.8173 796.2624 819.5202 842.9342 853.2165 859.0769 914.6411 917.6311 920.5021 943.2516 960.4929 974.5763 991.8965 994.4604 1004.8649 1030.7620 1049.3140 1087.2442 1102.1325 1105.1572 1131.2846 1141.4453 1165.5915 1173.0899 1180.4974 1181.6929 1197.2671 1221.5404 1228.5172 1260.7800 1274.7795 1320.3083 1324.2506 1326.5429 1328.3421 1337.0834 1338.0566 1340.2555 1349.6256 1455.1350 1455.9026 1466.3917 1469.2809 1477.5129 1480.1288 1488.0393 1491.4116 1683.4798 2973.1387 2988.4372 2995.1381 3002.6775 3007.5828 3019.8155 3025.0189 3028.1010 3032.9706 3051.9359 3058.8083 3073.3857 3085.1962 3090.7561 3104.6437 3107.2186
redmass: 4.0237 2.9432 3.6623 4.0493 3.5700 2.6990 2.8151 4.0525 6.3481 2.3455 2.8022 3.5402 2.1151 5.3346 2.8672 3.2683 2.8680 3.7412 6.2474 3.4330 3.4336 6.3687 6.8254 2.4836 2.0824 2.1718 1.9493 1.8771 1.9184 3.8813 3.6807 1.7372 2.4907 3.2236 4.8729 2.9217 3.6278 1.9473 2.2770 3.2488 1.5923 1.9443 2.6153 2.2344 2.1540 1.5058 1.7386 1.2545 1.7748 1.2319 1.5486 1.6186 1.3498 1.3380 1.3612 1.3433 1.2757 1.3117 1.4197 1.3935 1.3451 1.4742 1.0820 1.0919 1.0817 1.0884 1.0878 1.0864 1.0889 1.0910 12.2101 1.0626 1.0624 1.0609 1.0636 1.0616 1.0613 1.0628 1.0595 1.0961 1.1014 1.1011 1.1016 1.1036 1.1015 1.1095 1.1064
irintensity: 5.4617 5.5418 2.9651 0.9200 1.8483 2.8868 6.4606 0.5547 0.3745 2.2307 4.8532 1.4305 1.3821 8.9542 3.9998 5.7079 3.9190 10.0149 5.6004 0.4528 4.5694 1.4447 3.7585 15.6640 1.5471 8.6330 11.0984 8.3082 6.9260 110.1397 8.1604 12.7950 11.2960 47.9055 34.0463 26.1447 16.7295 9.5783 8.3894 118.1202 3.2103 57.4997 99.8969 1.6098 11.7248 40.8509 15.9597 25.1653 6.2192 1.4889 12.5203 9.4687 11.4982 6.6169 7.5387 1.3240 0.9662 1.5396 1.2376 3.1816 1.4624 3.9392 3.5457 25.2053 6.3009 7.6762 3.9806 11.9522 4.9556 12.6442 245.6638 29.3559 33.4002 34.0371 18.9423 73.0606 44.1078 18.0022 51.3974 42.3408 23.1119 30.4701 36.4695 9.1177 14.5926 38.1831 22.9715
temp: 298.150 k
press: 1.00000 atm
elementType: 8 8 8 8 6 6 6 6 6 6 6 6 6 6 6 1 1 1 1 1 1 1 1 1 1 1 1 1 1 1 1
symmnumber: 1
zpe: 677467.1 jmol-1
zpe.correction: 0.258034 hartree
zpe.thermalcorrener: 0.271438 hartree
zpe.thermalcorrenthalpy: 0.272382 hartree
zpe.thermalcorrgfe: 0.218413 hartree
zpe.sumelectzpe: -728.482306 hartree
zpe.sumelectthermal: -728.468902 hartree
zpe.sumelectthermalent: -728.467958 hartree
zpe.sumelectthermalfe: -728.521926 hartree
dipole: 0.4571 2.6438 2.3309
dipole: 3.5542
quadrupole: -85.9008 -84.7014 -93.7048
quadrupole: -10.5389 -4.7913 -3.4775
quadrupole: 2.2016 3.4009 -5.6025 -10.5389 -4.7913 -3.4775
hfenergy: -728.7403396 hartree
pointgroup: C01 [X(C11H16O4)]
dipole: 0.7333257 0.6336 1.0079966 debye
polarizability: 122.3633325|0.6144501|130.6847537|-3.5940724|9.5762999|107.6796679 unknown
InChI: InChI=1S/C11H16O4/c12-9-10(5-6-13-9)3-1-2-4-11(10)14-7-8-15-11/h1-8H2
charge 0 multiplicity 1
31 atoms
O  0.297354 -1.644264 1.273878
O  1.21178 -1.266453 -0.86852
O  -2.66619 0.568536 0.009981
O  -1.645862 -0.797639 -1.542622
C  -0.2430 0.521927 0.099679
C  0.822916 -0.596228 0.385069
C  0.404607 1.584796 -0.852696
C  2.085435 0.00108 1.026285
C  -0.790147 1.132417 1.421643
C  1.709635 2.173953 -0.267883
C  2.72139 1.062473 0.097982
C  -1.524841 -0.011834 -0.587848
C  -2.24635 1.516065 1.085327
C  -0.153128 -2.774311 0.421343
C  0.71842 -2.663701 -0.853008
H  -0.324027 2.392821 -1.060473
H  0.621671 1.079993 -1.812554
H  2.78634 -0.830739 1.214897
H  1.822449 0.44471 2.005529
H  -0.21179 2.004231 1.766425
H  -0.77108 0.360033 2.210345
H  1.485945 2.78484 0.630501
H  2.156561 2.862927 -1.009756
H  3.061735 0.558238 -0.826154
H  3.613229 1.500229 0.584391
H  -2.950839 1.379292 1.920032
H  -2.342531 2.539459 0.680452
H  -1.227659 -2.676128 0.191137
H  0.028907 -3.694298 0.99938
H  1.596225 -3.334755 -0.823191
H  0.131942 -2.827569 -1.77117
