program: Gaussian 09
title: 000269701
version: EM64L-G09RevD.01
frameworkgroup: C1[X(C19H22Cl2N2O2)]
method: RPBEPBE
basis: SDD
operation: Freq
keyword: #p
keyword: freq=noraman
keyword: PBEPBE/SDD
title: #p freq=noraman PBEPBE/SDD
converged: YES YES NO NO
title: Mulliken charges:
elementType: Cl Cl O O N N C C C C C C C C C C C C C C C C C C C H H H H H H H H H H H H H H H H H H H H H H
charge: -0.077007 -0.061521 -0.443485 -0.312411 -0.103753 -0.175636 -0.378910 -0.357477 -0.397960 -0.384443 -0.377637 -0.134304 0.485786 -0.322879 -0.365386 -0.360372 -0.221615 -0.221671 -0.118677 0.396346 -0.323947 -0.372890 -0.202635 -0.184863 -0.120427 0.219288 0.193230 0.197592 0.207129 0.210107 0.217286 0.207513 0.214265 0.218361 0.225214 0.222613 0.236960 0.234254 0.222570 0.237959 0.352447 0.249259 0.248737 0.257542 0.253200 0.254592 0.257657
chargesum: 0.00000
title: Mulliken charges with hydrogens summed into heavy atoms:
elementType: Cl Cl O O N N C C C C C C C C C C C C C C C C C C C
charge: -0.077007 -0.061521 -0.091038 -0.312411 -0.103753 -0.175636 0.033608 0.047244 0.029433 0.037334 0.065938 0.088309 0.485786 0.148335 -0.142816 -0.122414 0.027644 0.027066 -0.118677 0.396346 -0.066405 -0.119691 0.051957 0.072794 -0.120427
polarizability: 3.30775160e+02 4.11877867e+00 2.50618738e+02 -2.76484395e+01 -5.77371813e+00 1.70996304e+02
1716.lowfreq: -2.4749 -0.0020 -0.0010 0.0006 2.6118 8.9663 11.1006 19.2991 26.4374
frequency: 9.3093 19.2431 26.3956 32.7561 44.1684 57.2816 70.6531 81.9058 96.5769 114.1333 149.3152 150.3096 163.9841 205.0348 212.8536 233.4252 259.8746 271.2231 282.7093 315.9555 326.6684 333.0700 349.5922 351.7196 386.8109 411.2779 414.3014 425.4258 432.9861 438.3366 459.6486 466.6852 477.5115 498.3064 508.7295 539.2964 579.8017 624.4890 626.1553 643.3713 672.0208 694.1458 695.2322 731.5180 777.2132 797.6290 803.7619 805.1572 808.4822 823.1640 843.0706 845.4505 912.6560 919.8570 925.8504 930.6869 942.1804 944.7068 950.0816 952.4168 982.9799 990.9219 999.6678 1007.3161 1051.3595 1063.1632 1072.3476 1072.7433 1081.4458 1095.0612 1107.2062 1110.5774 1119.7656 1141.6326 1146.0527 1172.9313 1175.2964 1196.9405 1204.9336 1217.5947 1224.1033 1232.1380 1243.1929 1252.5354 1289.8020 1290.9435 1300.6769 1302.6406 1324.7483 1342.3436 1344.5112 1352.0118 1358.1442 1366.7522 1370.5728 1373.2213 1380.1131 1383.6179 1391.9230 1405.4761 1413.3485 1454.0707 1455.6623 1457.4047 1461.6519 1467.1492 1476.0291 1479.3165 1491.5643 1572.1361 1586.8686 1605.0808 1610.1398 2866.8350 2872.9952 2909.2014 2920.6433 2926.2410 2982.3810 3035.5488 3038.2045 3042.8255 3052.7978 3055.1214 3056.9054 3090.4720 3148.7736 3153.6390 3157.5224 3158.4417 3169.8520 3175.7698 3176.1132 3179.6022 3534.9666
redmass: 11.2915 5.4209 3.7631 4.9749 6.4903 3.1907 6.8347 5.3773 6.1436 5.4124 6.6783 6.3536 5.0231 4.5303 4.3324 2.5576 3.7066 4.2150 2.9300 6.0343 4.1399 5.2864 2.9542 6.0631 2.1207 2.9752 2.9122 1.6150 2.0516 3.2273 4.0619 3.9981 2.7454 2.7300 2.7656 4.2475 3.8298 7.0421 6.9556 2.6020 5.0388 3.5691 3.1432 4.8424 3.0035 1.4309 1.5057 2.7794 1.7802 1.5513 2.8002 1.6700 2.6772 2.5138 1.4319 1.4642 1.3684 2.3512 2.7680 1.4297 4.0217 3.8401 2.1249 2.4751 1.8447 2.0684 2.2245 2.4966 2.7261 2.2420 1.7989 1.4410 1.4270 2.6375 2.2404 2.0705 1.1745 1.1611 1.0991 2.2810 1.6844 1.6968 1.4688 1.3180 1.3044 1.3860 1.3895 1.3065 1.4107 1.6127 1.3051 1.3905 1.8401 1.8179 1.9780 2.8843 1.6389 1.5781 1.4046 3.7465 3.7285 1.1436 1.1175 1.0919 1.0962 1.1055 1.2029 1.7448 2.4903 7.3078 7.5287 6.5866 6.2585 1.0710 1.0696 1.0688 1.0708 1.0679 1.0551 1.0886 1.0888 1.0908 1.0925 1.0907 1.1066 1.0891 1.0871 1.0879 1.0883 1.0883 1.0961 1.0961 1.0967 1.0976 1.0653
irintensity: 0.1990 0.3882 0.1604 0.2333 0.2394 1.9265 0.4928 0.2926 2.4310 0.2495 0.0143 0.1108 6.4536 9.8788 3.4720 1.7367 1.0368 1.7863 4.3895 0.9923 11.0932 6.3800 0.7733 5.2814 2.1709 0.9752 0.3209 66.1692 101.2832 19.5171 16.4384 13.2398 1.4111 23.1729 24.6543 17.2929 10.9284 2.2024 0.4071 34.4654 29.5668 0.3412 3.0256 11.6261 10.5748 4.7826 9.1033 6.0239 67.2057 77.8657 14.2246 6.8920 39.7818 15.1108 3.2613 7.0975 1.0303 36.1024 36.8942 5.0873 28.5355 41.7274 20.5556 86.1531 4.8773 5.9976 40.0574 46.7496 13.8382 23.3422 10.1929 17.9962 5.1870 52.8947 62.7838 12.5291 47.6408 3.7978 19.3318 237.4760 62.2899 59.4260 150.8807 11.8525 14.8274 17.4352 28.2332 2.0272 13.0221 1.8629 3.7337 1.3699 14.2429 1.2353 28.9087 13.3283 24.0441 37.8900 12.3805 0.6988 0.5686 92.1070 71.2859 10.5630 48.8682 30.1218 50.6355 97.4781 251.0124 2.0446 11.0457 29.6939 83.1788 48.5627 89.3730 59.1191 89.3185 106.1996 21.1268 8.3630 22.3349 47.9161 53.6971 25.2798 29.9335 21.8184 11.2849 8.1774 6.9917 3.0481 15.5521 4.6215 7.3588 0.9065 18.3703
temp: 298.150 k
press: 1.00000 atm
elementType: 17 17 8 8 7 7 6 6 6 6 6 6 6 6 6 6 6 6 6 6 6 6 6 6 6 1 1 1 1 1 1 1 1 1 1 1 1 1 1 1 1 1 1 1 1 1 1
symmnumber: 1
zpe: 984773.4 jmol-1
zpe.correction: 0.375080 hartree
zpe.thermalcorrener: 0.398910 hartree
zpe.thermalcorrenthalpy: 0.399854 hartree
zpe.thermalcorrgfe: 0.317348 hartree
zpe.sumelectzpe: -1915.396034 hartree
zpe.sumelectthermal: -1915.372204 hartree
zpe.sumelectthermalent: -1915.371260 hartree
zpe.sumelectthermalfe: -1915.453766 hartree
dipole: -1.5563 1.7264 0.0404
dipole: 2.3246
quadrupole: -211.2031 -175.0625 -153.7879
quadrupole: 9.2812 -5.8342 -1.8375
quadrupole: -31.1853 4.9554 26.2299 9.2812 -5.8342 -1.8375
hfenergy: -1915.771114 hartree
pointgroup: C01 [X(C19H22Cl2N2O2)]
dipole: -0.6625553 0.6301078 0.0211043 debye
polarizability: 328.0359177|9.4066615|251.3681754|-31.6504877|-9.8227533|172.9861093 unknown
InChI: InChI=1S/C19H22Cl2N2O2/c20-15-1-5-17(6-2-15)23-11-9-22(10-12-23)13-18(24)14-25-19-7-3-16(21)4-8-19/h1-8,18,24H,9-14H2
charge 0 multiplicity 1
47 atoms
Cl 8.350078 -1.70593 -0.434934
Cl -6.897476 -4.123942 0.090406
O  -3.146718 3.650513 -0.205535
O  -3.615301 0.933326 0.195781
N  0.056368 1.683574 0.259918
N  2.771273 0.678828 0.117622
C  0.629745 0.880495 1.365584
C  1.128819 2.485302 -0.376917
C  1.725552 -0.067569 0.845173
C  2.221983 1.562255 -0.937975
C  -1.125099 2.49067 0.650324
C  -2.115466 2.656318 -0.530066
C  4.055782 0.10309 -0.042179
C  -2.752941 1.324611 -0.942072
C  5.120901 0.837684 -0.651265
C  4.353868 -1.21147 0.432812
C  6.413781 0.293449 -0.772844
C  5.651036 -1.756541 0.323049
C  6.670295 -1.00078 -0.280386
C  -4.350671 -0.257304 0.094664
C  -4.30715 -1.126485 -1.023353
C  -5.169523 -0.56745 1.209154
C  -5.086907 -2.306363 -1.021746
C  -5.94527 -1.742903 1.211074
C  -5.893477 -2.599632 0.091429
H  -0.174143 0.275719 1.823089
H  1.070049 1.532821 2.160969
H  1.586959 3.19752 0.354641
H  0.702644 3.078832 -1.206127
H  1.259375 -0.845747 0.196791
H  2.179283 -0.570268 1.716629
H  3.023961 2.180837 -1.368611
H  1.784896 0.950589 -1.760322
H  -1.65081 1.978242 1.477217
H  -0.850151 3.508599 1.00955
H  -1.586701 3.074841 -1.405147
H  -1.964596 0.565534 -1.107296
H  -3.376887 1.452389 -1.847565
H  4.958608 1.85787 -1.010831
H  3.572982 -1.83607 0.87386
H  -3.803084 3.206509 0.393032
H  7.214387 0.878881 -1.234779
H  5.854179 -2.766352 0.692173
H  -3.680658 -0.905845 -1.891699
H  -5.188941 0.116752 2.062646
H  -5.06134 -2.983144 -1.880624
H  -6.578596 -1.987551 2.068487
