program: Gaussian 09
title: 000269575
version: EM64L-G09RevD.01
frameworkgroup: C1[X(C13H16N4O2)]
method: RPBEPBE
basis: SDD
operation: Freq
keyword: #p
keyword: freq=noraman
keyword: PBEPBE/SDD
title: #p freq=noraman PBEPBE/SDD
converged: YES YES NO NO
title: Mulliken charges:
elementType: O O N N N N C C C C C C C C C C C C C H H H H H H H H H H H H H H H H
charge: -0.223598 -0.253652 -0.416954 -0.604732 -0.009746 0.014783 0.304763 0.409207 -0.611102 -0.460997 -0.454610 -0.205795 -0.455560 -0.317833 -0.761610 0.056089 0.236565 -0.188668 -0.185027 0.217025 0.262267 0.194651 0.244298 0.252340 0.185421 0.279975 0.252087 0.217654 0.274977 0.375165 0.248690 0.216407 0.216097 0.339784 0.351638
chargesum: 0.00000
title: Mulliken charges with hydrogens summed into heavy atoms:
elementType: O O N N N N C C C C C C C C C C C C C
charge: -0.223598 -0.253652 -0.041789 0.086690 -0.009746 0.014783 0.304763 0.409207 -0.131810 -0.022048 -0.016849 0.074180 0.014182 -0.042857 -0.080415 0.056089 0.236565 -0.188668 -0.185027
polarizability: 1.90551565e+02 -1.20326015e+01 1.45614021e+02 -1.90168325e+00 -3.13552644e+00 1.37813160e+02
1716.lowfreq: -6.1057 -0.0006 -0.0004 -0.0003 8.5552 11.4317 16.8973 46.6224 56.6212
frequency: 16.6699 46.6171 56.5962 91.0106 106.1727 131.4741 137.0530 147.6351 196.9509 227.1102 229.8165 246.6921 268.7877 273.4494 290.1502 308.6499 331.3950 388.3860 395.5383 401.7381 421.7751 430.3381 445.2520 471.3338 505.0114 515.1923 533.5341 555.0408 561.9063 585.8663 606.5203 611.4362 693.0054 736.2021 760.5314 804.6451 824.4741 835.6973 839.7675 867.9602 886.7545 908.3086 950.3529 956.7524 969.8900 987.0778 1012.3482 1027.8221 1038.7338 1052.2788 1069.7898 1087.4086 1095.8868 1131.9153 1171.5207 1176.3064 1194.0514 1215.7399 1228.7509 1241.7547 1250.4807 1279.2632 1296.5753 1308.9599 1316.2752 1326.9863 1333.6584 1338.2375 1350.7457 1359.4027 1394.2213 1417.1056 1452.7890 1460.9546 1470.6816 1475.5214 1480.1807 1485.4795 1601.3533 1619.3987 1661.3382 2187.7382 2199.9996 2962.1159 2968.7446 2972.1530 2974.7709 2981.1396 2984.5609 3001.5518 3040.0571 3044.1226 3053.8021 3062.3893 3068.5054 3077.2922 3414.3764 3511.3415 3660.6853
redmass: 5.0892 8.4783 10.8860 6.9469 6.5149 6.5619 6.4173 5.9334 3.6310 1.6554 1.8789 3.1983 4.0388 2.9155 3.5922 3.5734 4.2853 2.8351 3.3603 3.7925 5.2797 4.3731 5.0243 4.3070 3.7422 1.4445 3.3897 2.7529 2.8221 2.6239 3.7258 1.9031 2.9866 3.3837 2.9548 1.6316 2.0550 4.0093 2.9596 1.7356 2.6961 2.6096 2.7048 2.2291 1.9062 2.4883 2.9279 1.8936 2.9158 1.7975 1.8779 1.9091 1.5799 2.6301 2.1235 1.8177 1.6802 1.5082 1.4661 1.4260 1.5425 2.1683 1.4920 1.3834 1.6379 1.6531 2.8254 3.8407 1.5297 1.4451 1.2026 1.6184 1.0853 1.0975 1.0810 1.0628 1.0576 1.0813 1.6513 4.2401 3.5887 12.5524 12.5596 1.0798 1.0658 1.0499 1.0501 1.0765 1.0632 1.0629 1.0974 1.1021 1.0982 1.1004 1.0993 1.0993 1.0766 1.0456 1.1044
irintensity: 10.7270 1.2997 0.8073 5.6422 0.5614 1.4666 6.4009 0.3631 2.8996 0.9122 1.5410 0.4675 2.4742 0.9563 7.5341 3.5676 4.3399 0.8119 0.7145 0.1361 2.6836 3.1389 0.1369 3.5129 11.1621 32.1231 4.2221 12.9709 19.4143 56.6945 29.2853 110.1228 53.2723 3.6983 4.8473 91.0532 43.4821 6.0107 0.6992 2.9522 1.3965 5.8416 6.5135 5.1490 10.8394 0.6256 8.6362 5.0335 2.5506 1.6469 3.5571 1.9274 3.7343 3.7820 3.6856 0.7218 1.5473 20.3133 6.0747 2.7089 5.5087 15.2974 3.2730 0.9865 41.6363 59.0933 176.1690 66.8585 6.2068 5.2085 16.1211 98.2954 5.1724 1.3702 3.3060 12.7692 18.3269 11.1665 78.9213 548.8291 162.3280 8.3312 9.5170 3.9822 22.0347 8.5878 34.7257 6.8862 38.7666 18.5948 20.3092 12.5302 22.7515 24.3656 40.6183 24.1980 177.2258 65.7207 38.1785
temp: 298.150 k
press: 1.00000 atm
elementType: 8 8 7 7 7 7 6 6 6 6 6 6 6 6 6 6 6 6 6 1 1 1 1 1 1 1 1 1 1 1 1 1 1 1 1
symmnumber: 1
zpe: 730594.0 jmol-1
zpe.correction: 0.278269 hartree
zpe.thermalcorrener: 0.296295 hartree
zpe.thermalcorrenthalpy: 0.297239 hartree
zpe.thermalcorrgfe: 0.232223 hartree
zpe.sumelectzpe: -873.035475 hartree
zpe.sumelectthermal: -873.017448 hartree
zpe.sumelectthermalent: -873.016504 hartree
zpe.sumelectthermalfe: -873.081520 hartree
dipole: -7.1750 6.5522 5.6681
dipole: 11.2490
quadrupole: -110.2777 -124.4613 -119.1830
quadrupole: 10.2620 -7.1515 0.0069
quadrupole: 7.6963 -6.4873 -1.2090 10.2620 -7.1515 0.0069
hfenergy: -873.3137431 hartree
pointgroup: C01[X(C13H16N4O2)]
dipole: -2.8117434 -3.2197018 1.1464237 debye
polarizability: 191.0829611|8.4370682|137.2375964|-7.5606467|-1.0984471|145.6581883 unknown
InChI: InChI=1S/C13H16N4O2/c1-12-3-2-4-13(7-12,8(5-14)10(16)18)17-11(19)9(12)6-15/h8-9,17H,2-4,7,16H2,1H3
charge 0 multiplicity 1
35 atoms
O  1.240187 2.281445 -1.383432
O  -2.781713 0.270248 -1.913399
N  -0.307895 0.719471 -0.653496
N  -4.480498 -0.604521 -0.604795
N  4.4617 0.836342 -0.610353
N  -2.757725 1.251599 2.308738
C  1.676642 -0.729272 0.923217
C  -0.686413 -0.558345 -0.008812
C  0.166236 -0.745046 1.268775
C  1.979328 -1.857741 -0.107857
C  -0.429031 -1.755925 -0.979857
C  1.982942 0.711872 0.36217
C  1.0677 -1.835274 -1.356978
C  -2.211661 -0.514325 0.382446
C  2.517851 -0.957513 2.201201
C  0.950413 1.292103 -0.655184
C  -3.172635 -0.242793 -0.826138
C  3.345541 0.808987 -0.191295
C  -2.50531 0.467763 1.444976
H  -0.088907 -1.715509 1.737177
H  -0.064878 0.052624 2.000507
H  1.847553 -2.824559 0.4200
H  3.040786 -1.805194 -0.414351
H  -1.042608 -1.638876 -1.89076
H  -0.740399 -2.695459 -0.477272
H  1.93673 1.413094 1.223852
H  1.330367 -0.981663 -2.009247
H  1.245929 -2.745747 -1.958733
H  -2.458524 -1.519212 0.783882
H  -0.959516 1.055772 -1.378594
H  3.598664 -0.903054 1.977371
H  2.290493 -0.200952 2.975785
H  2.311747 -1.95544 2.630328
H  -4.804225 -0.966545 0.291515
H  -5.168067 -0.408258 -1.333586
