program: Gaussian 09
title: 000269590
version: EM64L-G09RevD.01
frameworkgroup: C1[X(C16H18N6O2S)]
method: RPBEPBE
basis: SDD
operation: Freq
keyword: #p
keyword: freq=noraman
keyword: PBEPBE/SDD
title: #p freq=noraman PBEPBE/SDD
converged: YES YES NO NO
title: Mulliken charges:
elementType: S O O N N N N N N C C C C C C C C C C C C C C C C H H H H H H H H H H H H H H H H H H
charge: 0.949037 -0.539580 -0.540610 -0.363380 -0.013075 -0.048227 0.019763 -0.718439 -0.637341 -0.568871 -0.441438 0.526904 0.407027 -0.389866 -0.388699 -0.040941 -0.040259 -0.238810 -0.240614 -0.465403 -0.213149 0.142575 0.246556 -0.459254 -0.780818 0.227455 0.244735 0.247551 0.228696 0.330184 0.241387 0.247199 0.283236 0.284118 0.221504 0.250549 0.334957 0.335872 0.227704 0.227931 0.261374 0.308607 0.333855
chargesum: 0.00000
title: Mulliken charges with hydrogens summed into heavy atoms:
elementType: S O O N N N N N N C C C C C C C C C C C C C C C C
charge: 0.949037 -0.539580 -0.540610 -0.033196 -0.013075 -0.048227 0.019763 -0.047610 0.005121 -0.096681 0.034808 0.526904 0.407027 -0.148478 -0.141499 -0.040941 -0.040259 0.044426 0.043504 -0.243899 -0.213149 0.142575 0.246556 -0.208705 -0.063809
polarizability: 4.03201600e+02 3.04309777e+01 2.81328144e+02 1.93710509e+01 -3.39056886e+00 1.34564637e+02
1716.lowfreq: -3.5733 0.0013 0.0018 0.0021 4.6985 9.2061 11.5642 18.0136 20.4783
frequency: 10.7316 17.3321 20.2756 34.1866 34.4029 46.2100 55.8208 85.8100 103.3998 112.8102 120.6450 136.1511 153.0238 178.8071 200.1911 238.7180 243.4771 260.1068 273.4992 284.4672 292.7180 307.2882 319.5086 351.9014 371.0439 382.4480 384.2801 405.2325 408.4487 439.0413 447.1650 467.2578 475.7373 483.3007 527.7238 535.4140 544.6618 599.5328 608.7706 622.0861 636.9989 647.1456 651.4832 681.3925 698.0320 727.6304 730.9613 768.9240 796.0002 797.4455 799.6633 802.6997 817.0134 819.5435 851.8750 853.8873 885.1032 907.3731 930.5649 964.0776 971.2084 984.1795 992.3260 995.8077 1001.6366 1010.0275 1042.9867 1045.9123 1055.5845 1071.7160 1084.9679 1119.4415 1144.2907 1182.5777 1189.6765 1210.5970 1219.0559 1255.3791 1262.0370 1275.0616 1289.0987 1294.6258 1306.7607 1355.0608 1358.4731 1386.3383 1388.1567 1390.8469 1398.8457 1400.0015 1435.9995 1456.3626 1467.2757 1469.2608 1473.2304 1485.7683 1488.7244 1495.2132 1529.0563 1533.3513 1554.6823 1594.9847 1595.6993 1613.2871 1625.3318 2983.2532 2987.4164 3007.0594 3046.7372 3061.3097 3073.7381 3119.9630 3130.5117 3134.8414 3138.6637 3145.1631 3161.6186 3164.4711 3362.3459 3468.3701 3529.4375 3548.3882 3706.2030
redmass: 6.4379 5.1609 5.9796 2.5944 1.2804 4.9040 4.6795 4.4680 6.6463 1.4619 4.6980 5.3941 5.0174 3.3567 4.3242 6.2348 3.1630 2.5701 4.1128 5.6424 6.9786 3.6618 5.1383 3.0665 1.1851 4.9661 3.7313 5.5255 3.0388 6.9215 6.8038 6.1487 5.2187 4.0275 1.1745 3.1861 4.9343 4.3532 3.7142 6.8895 3.6339 7.4095 3.4737 1.4991 2.5849 3.7307 3.6684 6.1976 2.7128 1.5267 2.5711 2.3749 2.6465 3.9897 1.2878 1.7650 1.3318 4.0423 3.8938 1.5383 1.8304 1.3808 3.4780 5.2253 3.6969 1.7344 1.8410 1.5889 2.5002 1.5093 2.9826 1.3393 2.5052 1.1284 1.6069 2.5795 2.3735 3.9040 1.9508 2.7269 1.3710 1.2870 1.1924 1.6957 1.5733 2.1032 5.5999 2.4595 3.5694 2.7545 3.1614 1.2564 1.0465 1.4193 2.0431 1.3412 2.8097 2.1926 4.9689 1.0855 3.0539 6.1492 7.3827 1.4101 5.2015 1.0382 1.0617 1.0599 1.1007 1.0971 1.1051 1.0982 1.0894 1.0894 1.0923 1.0917 1.0950 1.0964 1.0414 1.0766 1.1000 1.0450 1.1045
irintensity: 0.9240 0.6808 1.0969 1.2957 1.1139 0.6858 0.4997 0.0639 0.9002 37.5749 12.3211 0.7815 1.5318 1.9783 2.6587 4.3399 4.9131 3.5788 8.1814 3.8419 3.7613 0.6971 2.4213 5.0991 158.2305 10.0801 3.0722 27.5519 2.7536 16.9835 19.1479 5.8318 31.4641 119.2180 112.2245 96.7130 12.8251 23.7185 2.5174 0.1152 0.7808 8.6378 24.4979 56.5706 21.8778 4.4748 2.3125 1.3686 26.7385 4.8400 40.6455 55.1665 161.9521 37.3322 3.7005 31.1120 12.4977 59.3705 0.9064 9.2915 12.8150 0.3530 10.4634 1.9616 17.6749 5.9892 1.2380 7.7796 37.3831 26.8343 23.6009 1.5950 18.2290 6.5905 6.8782 26.6831 0.2470 77.1679 38.2791 53.9952 31.1907 0.1297 1.6928 67.7070 24.7970 154.9611 5.8600 31.6755 10.1611 9.5895 166.5116 29.1710 16.8528 31.1760 14.0781 50.3222 67.6942 65.6679 101.4405 22.3284 438.2491 16.3489 2.0817 114.5264 635.1460 20.4117 26.3397 35.9550 3.6695 18.5016 20.3954 7.5589 13.7303 7.7580 18.9938 30.4398 0.5696 9.5123 27.8360 67.7458 24.3111 116.3471 33.3939
temp: 298.150 k
press: 1.00000 atm
elementType: 16 8 8 7 7 7 7 7 7 6 6 6 6 6 6 6 6 6 6 6 6 6 6 6 6 1 1 1 1 1 1 1 1 1 1 1 1 1 1 1 1 1 1
symmnumber: 1
zpe: 859049.4 jmol-1
zpe.correction: 0.327195 hartree
zpe.thermalcorrener: 0.351805 hartree
zpe.thermalcorrenthalpy: 0.352749 hartree
zpe.thermalcorrgfe: 0.268540 hartree
zpe.sumelectzpe: -1495.558747 hartree
zpe.sumelectthermal: -1495.534138 hartree
zpe.sumelectthermalent: -1495.533193 hartree
zpe.sumelectthermalfe: -1495.617402 hartree
dipole: -0.2709 -1.2347 2.8474
dipole: 3.1154
quadrupole: -205.2612 -136.1179 -157.6782
quadrupole: 13.8279 23.4660 1.2979
quadrupole: -38.9088 30.2346 8.6743 13.8279 23.4660 1.2979
hfenergy: -1495.8859421 hartree
pointgroup: C01 [X(C16H18N6O2S1)]
dipole: 0.110848 -0.1576593 1.2104326 debye
polarizability: 400.1257128|42.2813815|242.3384723|-3.130585|66.4397231|176.6301957 unknown
InChI: InChI=1S/C16H18N6O2S/c1-10-9-20-15-13(8-14(17)22-16(15)21-10)19-7-6-11-2-4-12(5-3-11)25(18,23)24/h2-5,8-9,19H,6-7,17-18H2,1H3
charge 0 multiplicity 1
43 atoms
S  -6.953335 -0.364895 -0.09912
O  -7.748133 1.035149 0.151773
O  -7.296849 -1.39353 -1.315176
N  1.263941 0.563268 0.887096
N  4.348344 -1.552824 -1.181388
N  3.846519 1.407954 1.027998
N  5.927239 -0.004705 -0.341129
N  -7.110675 -1.341321 1.457211
N  2.822549 -3.083915 -2.018355
C  -0.900168 0.925628 -0.365269
C  -0.173061 0.3186 0.882545
C  -2.387771 0.628874 -0.335851
C  2.196029 -0.162526 0.182122
C  -2.901411 -0.557784 -0.92386
C  -3.287058 1.511507 0.319667
C  -5.115102 0.026584 -0.179985
C  3.576813 0.29229 0.273945
C  -4.275394 -0.873736 -0.853015
C  -4.665692 1.220462 0.404355
C  1.94276 -1.298946 -0.603087
C  4.608468 -0.437558 -0.42651
C  3.048431 -1.955459 -1.251376
C  6.183052 1.096585 0.406495
C  5.135314 1.804656 1.093025
C  7.617981 1.565956 0.49877
H  -0.717361 2.015685 -0.372382
H  -0.433914 0.509866 -1.27714
H  -0.607708 0.755043 1.800145
H  -0.370328 -0.770291 0.925638
H  1.658482 1.368363 1.387536
H  -2.223088 -1.235482 -1.455697
H  -2.90802 2.441921 0.75837
H  -4.688741 -1.77019 -1.326052
H  -5.373659 1.906145 0.880626
H  0.931406 -1.699033 -0.723326
H  5.358721 2.693476 1.691975
H  -7.724025 -0.814294 2.101649
H  -7.488483 -2.271171 1.208296
H  7.728651 2.597436 0.114807
H  7.973272 1.566872 1.546312
H  8.258966 0.895478 -0.093432
H  1.897554 -3.487169 -2.13115
H  3.630185 -3.519772 -2.459357
