program: Gaussian 09
title: 000269557
version: EM64L-G09RevD.01
frameworkgroup: C1[X(C13H13NO6S)]
method: RPBEPBE
basis: SDD
operation: Freq
keyword: #p
keyword: freq=noraman
keyword: PBEPBE/SDD
title: #p freq=noraman PBEPBE/SDD
converged: YES YES NO NO
title: Mulliken charges:
elementType: S O O O O O O N C C C C C C C C C C C C C H H H H H H H H H H H H H
charge: 0.136216 -0.237265 -0.273884 -0.284392 -0.232789 -0.197831 -0.199110 0.028144 -0.449909 -0.450767 -0.019784 0.017401 -0.337944 -0.503443 0.208192 0.236334 -0.319012 -0.309290 -0.348467 -0.343426 0.389609 0.299662 0.309782 0.287226 0.243496 0.257833 0.261138 0.236987 0.212975 0.234844 0.282980 0.280420 0.292940 0.291134
chargesum: 0.00000
title: Mulliken charges with hydrogens summed into heavy atoms:
elementType: S O O O O O O N C C C C C C C C C C C C C
charge: 0.136216 -0.237265 -0.273884 -0.284392 -0.232789 -0.197831 -0.199110 0.028144 -0.150248 -0.140986 0.267442 0.260898 0.181027 0.181364 0.208192 0.236334 -0.036032 -0.028870 -0.055527 -0.052292 0.389609
polarizability: 2.74342574e+02 -1.59142902e+01 1.46408581e+02 6.58206447e+00 1.45637541e+01 1.53665640e+02
1716.lowfreq: -5.6060 -0.0017 -0.0015 -0.0011 1.2330 8.0127 17.0155 21.5047 28.3949
frequency: 16.9238 21.3989 28.3446 47.2559 61.1459 70.9031 85.4046 103.1031 125.0438 141.9879 157.2102 173.8499 207.1475 224.1216 257.7845 262.5345 301.5896 311.5519 329.5287 369.7175 409.2165 415.6174 458.7246 480.3641 504.1038 512.2333 520.7988 621.2472 623.2195 651.7206 652.5279 679.1243 685.1982 723.6389 747.6160 757.8763 764.5525 797.9940 849.8206 860.0805 864.1681 873.5966 888.9995 911.2944 937.9788 968.3173 984.9651 1004.0053 1004.7857 1011.7369 1020.1632 1037.6346 1053.2167 1063.5497 1071.9504 1089.3317 1108.2888 1109.5255 1115.0153 1145.2417 1175.7899 1213.3728 1218.6199 1240.7795 1243.5755 1265.5502 1276.4327 1292.3286 1306.8421 1318.1881 1327.8270 1355.1891 1369.2558 1404.8381 1415.1544 1430.6144 1451.5363 1457.4895 1474.4111 1477.7497 1591.1806 1609.5670 1627.4649 2962.0491 3031.2382 3045.5142 3058.5533 3078.0766 3122.9405 3133.2698 3165.6649 3173.6147 3176.3377 3188.2850 3188.8817 3193.9644
redmass: 6.5937 8.1375 6.2868 8.7838 5.6244 5.8475 8.9190 3.5628 3.8608 2.3925 1.6313 8.3158 5.8107 6.5376 7.4361 5.6584 7.5098 4.8939 4.1884 7.4638 2.8851 4.2538 4.2150 9.5565 7.2112 6.1002 5.9232 6.5553 7.1302 4.3814 5.7335 7.7435 3.9223 5.2363 6.4237 7.2525 5.1082 7.8615 2.5781 4.2496 1.2463 4.0490 1.6671 6.7962 1.8366 2.3332 2.6226 1.4628 2.8125 1.3692 1.5537 4.1018 3.9861 1.8034 2.7530 3.2947 1.3316 1.3952 1.2998 1.3640 1.2301 5.6768 1.2787 1.2971 4.1768 1.5521 1.5342 1.2602 1.5556 1.5156 1.5385 1.2985 7.7733 7.9624 4.6571 1.1404 1.0997 1.0507 2.3982 1.0551 8.6308 6.3915 10.1919 1.0339 1.0873 1.0578 1.1007 1.0878 1.1015 1.1092 1.0901 1.0898 1.0890 1.0959 1.0947 1.0974
irintensity: 0.0967 0.1666 0.1569 0.0201 1.2449 0.1466 4.1862 2.8679 2.2498 6.8252 5.3596 4.2587 6.6497 0.9106 0.3622 3.1051 7.9313 12.0320 4.6505 6.9918 0.2002 17.7839 1.2753 8.0233 1.8325 20.1512 1.0350 16.6311 0.9084 1.9032 0.4144 3.2107 57.9709 9.3786 21.7000 23.5127 4.9464 25.4822 20.0626 61.1329 0.8211 29.5822 53.8162 47.0198 25.7361 119.4524 154.5448 5.9562 34.5576 0.0070 12.5731 104.8279 236.8324 54.8494 6.7606 13.3335 10.6938 7.8540 0.6631 7.6901 3.2845 510.1566 9.6727 6.9388 159.1101 16.2672 14.9154 0.7071 6.3725 26.1814 9.1363 11.0904 83.4568 11.8698 64.9186 6.1510 17.2583 12.0899 3.6716 13.0692 33.8571 2.4884 131.6388 71.8269 40.3971 12.3251 40.1873 7.4217 20.4817 2.4351 1.3015 0.9929 1.1275 0.6099 0.5081 0.7830
temp: 298.150 k
press: 1.00000 atm
elementType: 16 8 8 8 8 8 8 7 6 6 6 6 6 6 6 6 6 6 6 6 6 1 1 1 1 1 1 1 1 1 1 1 1 1
symmnumber: 1
zpe: 648005.9 jmol-1
zpe.correction: 0.246812 hartree
zpe.thermalcorrener: 0.266487 hartree
zpe.thermalcorrenthalpy: 0.267432 hartree
zpe.thermalcorrgfe: 0.194742 hartree
zpe.sumelectzpe: -1405.667858 hartree
zpe.sumelectthermal: -1405.648183 hartree
zpe.sumelectthermalent: -1405.647238 hartree
zpe.sumelectthermalfe: -1405.719928 hartree
dipole: 4.5874 -1.5359 2.0197
dipole: 5.2424
quadrupole: -153.1204 -131.0659 -131.4437
quadrupole: 0.2467 13.2940 -2.0042
quadrupole: -14.5771 7.4775 7.0996 0.2467 13.2940 -2.0042
hfenergy: -1405.91467 hartree
pointgroup: C01 [X(C13H13N1O6S1)]
dipole: -1.8470343 0.468502 0.789235 debye
polarizability: 275.3089649|-12.0728962|149.5773491|-3.1601479|-15.6616525|149.5304806 unknown
InChI: InChI=1S/C13H13NO6S/c1-18-13-11-10(21-11)9(20-13)6-19-12(15)7-2-4-8(5-3-7)14(16)17/h2-5,9-11,13H,6H2,1H3
charge 0 multiplicity 1
34 atoms
S  -3.778029 -2.525748 -1.654938
O  -4.126147 0.542588 -1.025152
O  -5.159646 0.201498 1.154661
O  -0.601066 0.541564 0.356452
O  0.012021 1.954251 -1.399566
O  6.679967 -0.093955 -0.320261
O  5.98435 -1.410813 1.407631
N  5.763137 -0.578074 0.447268
C  -2.809545 -1.375559 -0.456409
C  -4.227211 -1.63159 -0.026468
C  -2.715588 0.086233 -0.883822
C  -4.986682 -0.320234 -0.190644
C  -2.022406 0.959913 0.187041
C  -5.975054 1.428839 1.1942
C  0.327528 1.129593 -0.509416
C  1.720536 0.661034 -0.232221
C  2.762803 1.165599 -1.053158
C  2.012727 -0.25342 0.81321
C  4.092896 0.763403 -0.836601
C  3.339544 -0.663852 1.040512
C  4.357933 -0.147325 0.209823
H  -1.958042 -1.839959 0.046371
H  -4.483264 -2.271045 0.820122
H  -2.241758 0.234775 -1.867355
H  -5.953423 -0.37667 -0.725095
H  -2.480775 0.815019 1.177055
H  -2.061596 2.017826 -0.121548
H  -6.041624 1.709938 2.255848
H  -6.990882 1.23757 0.793551
H  -5.496131 2.238298 0.61352
H  2.508842 1.870208 -1.850941
H  1.199695 -0.629139 1.438958
H  4.917238 1.134077 -1.450792
H  3.599349 -1.365545 1.836965
