program: Gaussian 09
title: 000269543
version: EM64L-G09RevD.01
frameworkgroup: C1[X(C11H12O3)]
method: RPBEPBE
basis: SDD
operation: Freq
keyword: #pfreq=noraman
keyword: PBEPBE/SDD
title: #p freq=noraman PBEPBE/SDD
converged: YES YES NO NO
title: Mulliken charges:
elementType: O O O C C C C C C C C C C C H H H H H H H H H H H H
charge: -0.276641 -0.266122 -0.218178 0.376981 0.186948 -0.506077 0.326755 -0.352295 -0.367125 -0.282382 -0.222077 -0.533143 -0.535902 -0.132921 0.257585 0.241298 0.244713 0.263994 0.250898 0.223805 0.248741 0.223743 0.219840 0.249007 0.219802 0.158750
chargesum: 0.00000
title: Mulliken charges with hydrogens summed into heavy atoms:
elementType: O O O C C C C C C C C C C C
charge: -0.276641 -0.266122 -0.218178 0.376981 0.186948 -0.248491 0.326755 -0.110997 -0.122412 -0.018388 0.028822 0.163146 0.152748 0.025830
polarizability: 2.33871652e+02 1.97820818e+01 1.64912810e+02 -4.82730034e-03 -8.55384533e-02 6.16435785e+01
1716.lowfreq: -6.2560 -5.0495 -0.0003 0.0005 0.0006 0.9140 54.4788 74.5995 77.9843
frequency: 54.4349 74.5873 77.9842 89.5960 109.9265 138.4068 174.1872 190.6863 229.8821 238.1460 256.9855 278.9327 319.7574 323.6952 370.6692 385.4654 470.0179 504.8033 518.0475 593.2134 597.0555 610.0256 686.0642 733.8407 764.6370 798.9453 873.4813 896.1494 914.2049 921.8265 968.6164 988.4917 1015.8312 1017.9109 1111.4869 1113.4365 1114.6698 1141.8946 1144.9869 1157.7345 1187.4750 1207.3803 1235.0229 1263.2774 1281.6151 1300.6890 1372.4984 1391.1012 1429.0474 1440.0733 1440.7825 1466.6341 1469.3533 1469.6406 1475.5364 1486.8484 1570.4171 1595.1099 1620.4783 1629.1335 2857.5815 2955.8700 2962.3942 3042.7631 3051.7578 3114.5620 3126.6324 3128.0758 3133.5778 3154.1869 3165.4860 3174.4213
redmass: 3.9309 2.7775 6.9248 3.0985 2.2287 4.6091 3.4005 4.2957 1.0899 4.6383 1.1709 4.5597 3.2700 4.1975 6.5299 4.0998 2.7456 4.5279 5.1882 3.1672 4.7613 4.5540 5.6834 2.8096 5.7711 1.5073 1.5691 1.8257 1.3576 5.5613 1.6910 8.1815 3.5442 1.2046 1.2590 2.6118 1.2588 2.1701 1.6873 1.4139 1.9689 1.5227 2.0334 2.0905 1.8783 1.3900 1.7731 2.9724 1.5342 1.1746 2.1055 1.0505 1.1625 1.1091 1.1015 1.8488 7.1663 7.1260 5.9397 5.4357 1.0847 1.0333 1.0328 1.1039 1.1042 1.0904 1.0989 1.0997 1.0908 1.0868 1.0914 1.0954
irintensity: 0.3340 8.1854 1.3099 0.2635 3.3379 14.5409 0.5686 0.1671 0.0093 15.2347 0.6939 2.2069 2.9629 4.5957 4.2973 0.0542 3.4211 8.1178 1.6205 5.7439 2.6523 20.4194 33.1727 0.0102 1.8319 50.4165 19.5663 5.3342 0.7600 13.2364 7.1494 38.8739 77.3950 53.1818 0.1350 3.0500 0.1536 161.5626 49.2234 10.5552 187.9655 47.0994 39.1363 16.7624 116.5902 18.0339 79.3047 20.9209 81.0479 7.4543 50.1182 13.9779 126.8299 75.7962 1.3857 91.1700 83.9380 174.7191 60.9410 238.3002 128.7277 68.8963 79.7699 50.6490 46.2420 5.4864 25.1086 15.8097 9.6866 9.5791 2.4818 12.3774
temp: 298.150 k
press: 1.00000 atm
elementType: 8 8 8 6 6 6 6 6 6 6 6 6 6 6 1 1 1 1 1 1 1 1 1 1 1 1
symmnumber: 1
zpe: 533355.9 jmol-1
zpe.correction: 0.203145 hartree
zpe.thermalcorrener: 0.217272 hartree
zpe.thermalcorrenthalpy: 0.218216 hartree
zpe.thermalcorrgfe: 0.161690 hartree
zpe.sumelectzpe: -650.955759 hartree
zpe.sumelectthermal: -650.941632 hartree
zpe.sumelectthermalent: -650.940687 hartree
zpe.sumelectthermalfe: -650.997214 hartree
dipole: 7.4166 4.8855 -0.0005
dipole: 8.8811
quadrupole: -90.9571 -73.7723 -85.6431
quadrupole: -14.5058 0.0431 0.0335
quadrupole: -7.4995 9.6852 -2.1856 -14.5058 0.0431 0.0335
hfenergy: -651.1589035 hartree
pointgroup: C01[X(C11H12O3)]
dipole: -2.7146389 2.1499116 0.4661426 debye
dipolederiv: -0.356475 -0.725213 -0.0833853 -0.2339512 -1.575796 -0.1412674 -0.0237244 -0.1058184 -0.2921149 -1.2956559 -0.5737514 0.003176 -0.9084919 -0.8061852 0.0043261 -0.0383698 -0.0205841 -0.2960465 -1.1266287 0.3918188 0.1059781 0.6671531 -0.8328737 -0.109824 0.1414693 -0.0899557 -0.3746682 -0.4993762 0.2897208 0.072998 -0.2330687 -0.0331495 0.0126878 0.0077043 -0.0251505 0.0005457 0.1867382 1.0629357 0.1196743 0.1942426 0.9516697 0.0975054 0.0124617 0.0349405 0.0478216 -0.0130152 -0.3922584 -0.0578197 0.169369 -0.1274222 -0.0109731 0.0125081 0.0302314 -0.1389148 0.5042478 0.7680266 0.0635253 1.3074365 0.585697 -0.0343693 0.130059 0.0056105 0.0715268 0.01725 -0.4926419 -0.0746597 0.0394265 -0.0568741 0.011591 -0.0093995 0.0503855 -0.1664764 -0.1265928 0.1730196 0.0173157 -0.5081531 0.0443157 0.066001 -0.0665725 0.0153564 -0.1780162 0.9449584 -0.4085297 -0.1275331 -0.3532966 0.2648673 0.0720974 -0.1208472 0.0762434 -0.0816032 -1.224711 0.5714982 0.1495213 0.411134 -0.1680812 -0.0297543 0.1276941 -0.0409477 -0.1813139 0.2060154 -0.2108443 -0.0170555 -0.0105002 0.9512046 0.0772648 0.0073801 0.0911111 0.3362261 0.9289813 0.2464637 -0.0136074 -0.0525255 0.2010215 -0.0124669 -0.0505896 -0.0346027 0.3328237 1.9026427 -0.6559133 -0.2140003 -0.2308585 0.8415641 0.1126202 -0.1597881 0.1430867 0.1276777 0.1019036 0.0573938 0.010795 0.0291485 -0.0124498 -0.0225055 0.0072274 -0.0246291 0.1498199 0.0748608 0.0546243 0.0132097 0.0622441 -0.083884 -0.0351934 0.0142225 -0.0345939 0.1579031 -0.0934123 0.0083914 0.0198912 0.018925 0.1067691 -0.0083646 0.0209906 -0.007452 0.1607 0.0167366 -0.0699154 0.001392 -0.0986564 0.0484632 -0.0067729 -0.0017558 -0.0091053 0.1564414 -0.0049651 -0.0734851 0.0032447 -0.0986379 -0.0130204 -0.0163881 0.0002773 -0.0182531 0.1681653 -0.0054775 0.179263 -0.1062905 0.007325 -0.037942 0.0040159 -0.0996327 0.060071 -0.0620163 -0.0319594 -0.1472434 -0.0059112 -0.0713452 -0.0269028 -0.0129552 0.0033037 -0.0073199 0.1237533 0.0259017 0.140993 0.1309078 -0.014466 -0.022841 0.0087298 0.084794 -0.0706933 -0.1093979 -0.047542 -0.0448889 0.0225612 0.1268538 0.0693973 -0.1111698 0.0937329 -0.0505203 -0.1233922 0.0142 -0.0759583 -0.0011933 -0.1430736 -0.0844571 -0.0150519 -0.0094749 -0.0200162 0.1225861 -0.064267 -0.0264894 -0.0370629 0.164191 0.0222137 0.1237368 -0.06345 0.0899975 -0.0597682 -0.0343582 -0.0470164 0.0043287 -0.2404242 -0.205304 -0.0235198 -0.0202206 -0.0373918 0.107738 unknown
polarizability: 228.6019247|-24.1793152|167.2027891|-15.3471076|14.877141|64.6233274 unknown
InChI: InChI=1S/C11H12O3/c1-13-10-5-6-11(14-2)9(8-10)4-3-7-12/h3-8H,1-2H3
charge 0 multiplicity 1
26 atoms
O  0.831484 2.384068 0.312771
O  -2.694202 -1.999585 0.03116
O  4.68212 -2.395645 -0.566389
C  0.405096 0.028588 0.053279
C  -0.118658 1.352739 0.255515
C  -0.512705 -1.04916 -0.012306
C  -1.902455 -0.842276 0.11562
C  -1.508766 1.558148 0.383444
C  -2.404821 0.467466 0.314454
C  1.851924 -0.156708 -0.075515
C  2.523726 -1.339363 -0.274697
C  0.347723 3.751871 0.510611
C  -4.143147 -1.836236 0.158944
C  3.986329 -1.354473 -0.382125
H  -0.158762 -2.072895 -0.164214
H  -1.91286 2.562476 0.537534
H  -3.477952 0.653196 0.415987
H  2.446748 0.76396 -0.001942
H  2.017682 -2.308505 -0.36229
H  -0.317039 4.065753 -0.317341
H  1.252154 4.377309 0.517637
H  -0.183917 3.853614 1.476503
H  -4.416432 -1.413886 1.145993
H  -4.555705 -2.851239 0.064776
H  -4.55006 -1.193361 -0.646379
H  4.474697 -0.349358 -0.28783
