program: Gaussian 09
title: 000269576
version: EM64L-G09RevD.01
frameworkgroup: C1[X(C15H10N2O4)]
method: RPBEPBE
basis: SDD
operation: Freq
keyword: #p
keyword: freq=noraman
keyword: PBEPBE/SDD
title: #p freq=noraman PBEPBE/SDD
converged: YES YES NO NO
title: Mulliken charges:
elementType: O O O O N N C C C C C C C C C C C C C C C H H H H H H H H H H
charge: -0.279364 -0.258834 -0.199363 -0.199892 0.028646 0.016388 0.498524 -0.177224 -0.370352 -0.348506 0.382672 -0.363025 -0.352082 0.222240 0.222725 -0.333732 -0.328963 -0.195031 -0.216802 -0.214810 -0.215345 0.293718 0.282427 0.263433 0.291467 0.291472 0.269963 0.273541 0.239362 0.238234 0.238513
chargesum: 0.00000
title: Mulliken charges with hydrogens summed into heavy atoms:
elementType: O O O O N N C C C C C C C C C C C C C C C
charge: -0.279364 -0.258834 -0.199363 -0.199892 0.028646 0.016388 0.498524 0.116493 -0.087925 -0.085073 0.382672 -0.071558 -0.060610 0.222240 0.222725 -0.063769 -0.055422 -0.195031 0.022560 0.023424 0.023168
polarizability: 2.42186363e+02 5.48741194e+00 1.70738747e+02 3.19261765e+00 2.61070624e+01 1.64930099e+02
1716.lowfreq: -7.3631 0.0003 0.0006 0.0008 0.5810 8.1274 19.4317 23.0214 33.0108
frequency: 19.4157 22.9551 32.9910 63.8134 66.5833 72.6121 92.2073 108.0496 153.4239 159.0783 217.6793 221.7751 257.8831 300.9948 339.8320 348.1519 381.1657 401.9193 408.8914 437.2587 442.1232 491.1538 503.2245 516.0754 586.5747 613.2799 624.1239 650.3170 666.8648 670.7907 679.7676 699.0906 742.6258 768.0107 792.8546 795.2783 835.1618 858.9415 864.4846 865.6589 889.6490 957.4919 989.9639 992.2326 997.2270 999.1697 1002.1736 1006.6698 1010.2730 1011.7841 1034.4804 1088.4257 1091.7038 1117.9695 1177.0452 1185.7292 1188.6125 1198.3476 1220.9158 1232.3176 1283.1570 1288.7267 1318.5401 1319.4851 1373.5918 1391.9660 1402.4265 1428.4298 1439.6178 1477.8338 1481.5036 1584.1770 1600.5515 1610.3274 1610.8991 1623.1706 2209.1418 3011.0268 3136.0586 3148.2253 3150.3776 3155.9235 3159.4817 3170.8779 3182.7169 3185.6470 3188.0930
redmass: 7.3044 5.1902 5.3362 7.8808 7.3505 8.1429 8.9104 9.1816 5.9624 8.1067 8.4907 8.4078 7.4569 6.9768 7.5796 8.2115 6.7074 2.8156 2.9075 5.6421 4.8275 8.8746 6.2678 5.2078 6.8694 6.4542 7.1598 7.6138 6.9895 4.6539 5.4481 1.6303 4.7597 8.2997 6.7359 2.2857 3.4684 1.4492 1.2996 3.0578 2.3174 1.4105 6.2304 1.4353 1.3931 4.7590 1.7494 2.4943 3.2990 1.3370 2.1491 1.5988 3.2465 1.3234 1.0581 1.1534 1.4804 2.0614 4.9783 2.7587 1.5793 1.4161 1.4209 1.3276 7.1839 9.8252 6.7697 3.0804 2.2538 2.2521 2.3582 6.5529 7.7026 6.0841 6.0526 10.8146 12.5939 1.0822 1.0859 1.0892 1.0912 1.0914 1.0939 1.0982 1.0982 1.0946 1.0958
irintensity: 0.2823 0.4719 0.1957 2.3707 1.8615 2.6418 1.6839 2.8626 1.2855 2.9800 7.3391 1.7267 0.0333 10.6049 2.6918 7.2430 7.0807 0.0068 0.4296 1.9395 0.6290 3.4885 3.0472 4.3570 14.4059 0.9725 0.1947 7.7636 5.9313 26.5854 13.1804 90.5243 2.4919 40.9320 45.4469 14.2926 37.2078 15.2573 7.3848 114.6664 7.6027 3.8568 24.1397 1.5153 1.1173 264.8117 30.3523 70.3913 19.2641 0.1694 63.6310 10.9659 15.0034 12.1209 0.6730 72.7534 70.1207 29.6474 258.5628 175.9829 10.5851 86.7243 3.8337 1.2011 98.4366 3.6000 3.9433 47.7597 20.9606 6.5131 4.3810 35.7026 4.3291 24.2983 12.1920 182.6884 0.5166 25.8374 0.3434 7.4183 1.5322 0.1841 12.1323 18.8517 7.6356 1.0349 2.8828
temp: 298.150 k
press: 1.00000 atm
elementType: 8 8 8 8 7 7 6 6 6 6 6 6 6 6 6 6 6 6 6 6 6 1 1 1 1 1 1 1 1 1 1
symmnumber: 1
zpe: 574789.1 jmol-1
zpe.correction: 0.218926 hartree
zpe.thermalcorrener: 0.236786 hartree
zpe.thermalcorrenthalpy: 0.237730 hartree
zpe.thermalcorrgfe: 0.169594 hartree
zpe.sumelectzpe: -986.440343 hartree
zpe.sumelectthermal: -986.422482 hartree
zpe.sumelectthermalent: -986.421538 hartree
zpe.sumelectthermalfe: -986.489675 hartree
dipole: -5.3304 -1.2324 0.0737
dipole: 5.4715
quadrupole: -127.9978 -137.9241 -114.8301
quadrupole: 21.4680 -8.6403 -0.1350
quadrupole: -1.0804 -11.0068 12.0872 21.4680 -8.6403 -0.1350
hfenergy: -986.6592686 hartree
pointgroup: C01 [X(C15H10N2O4)]
dipole: 2.1102313 -0.3927446 0.1630897 debye
polarizability: 242.6937676|-2.5177155|143.1503659|3.2186426|-8.8801983|192.0110759 unknown
InChI: InChI=1S/C15H10N2O4/c16-10-14(11-6-8-13(9-7-11)17(19)20)21-15(18)12-4-2-1-3-5-12/h1-9,14H
charge 0 multiplicity 1
31 atoms
O  1.113757 0.76591 -0.697431
O  1.661435 1.248989 1.524272
O  -4.953091 -1.645388 2.152284
O  -5.489346 -1.887987 -0.051626
N  -4.738924 -1.438272 0.896843
N  -0.240361 3.03093 -2.841866
C  -1.313337 0.894072 -0.195028
C  -0.063475 1.694593 -0.544835
C  -1.592872 0.642396 1.17293
C  -2.168877 0.378551 -1.200038
C  -3.549027 -0.628864 0.518471
C  -2.715412 -0.123634 1.539301
C  -3.294848 -0.390077 -0.848989
C  3.065289 -0.283355 0.23494
C  1.923769 0.637229 0.459661
C  3.953335 -0.515062 1.319569
C  3.281753 -0.924181 -1.014002
C  -0.158751 2.425912 -1.81846
C  5.050514 -1.383105 1.154459
C  4.382143 -1.791276 -1.171564
C  5.266165 -2.022492 -0.090361
H  0.178001 2.396068 0.278141
H  -0.922883 1.038585 1.943101
H  -1.9587 0.582251 -2.255403
H  -2.955527 -0.331921 2.584835
H  -3.972966 -0.799623 -1.601847
H  3.767049 -0.009678 2.272837
H  2.592697 -0.737269 -1.841856
H  5.735675 -1.562382 1.989483
H  4.55208 -2.28632 -2.133307
H  6.119834 -2.697396 -0.217216
