program: Gaussian 09
title: 000023019
version: EM64L-G09RevD.01
frameworkgroup: C1[X(C12H16O3)]
method: RPBEPBE
basis: SDD
operation: Freq
keyword: #pfreq=noraman
keyword: PBEPBE/SDD
title: #p freq=noraman PBEPBE/SDD
converged: YES YES NO NO
title: Mulliken charges:
elementType: O O O C C C C C C C C C C C C H H H H H H H H H H H H H H H H
charge: -0.288849 -0.263463 -0.423017 -0.342270 -0.386118 -0.352828 -0.267517 -0.692341 0.221251 0.187680 -0.318899 -0.314346 -0.380667 -0.334994 0.294560 0.189911 0.189219 0.208666 0.208312 0.196688 0.197006 0.226459 0.224262 0.210599 0.210534 0.217797 0.270517 0.272322 0.225600 0.255142 0.358785
chargesum: 0.00000
title: Mulliken charges with hydrogens summed into heavy atoms:
elementType: O O O C C C C C C C C C C C C
charge: -0.288849 -0.263463 -0.064232 0.036860 0.030860 0.040866 0.183205 -0.053411 0.221251 0.187680 -0.048382 -0.042024 -0.155067 -0.079853 0.294560
polarizability: 2.20235982e+02 1.01922992e+01 1.39532420e+02 1.22276709e+00 -8.88998763e-01 7.90162712e+01
1716.lowfreq: -17.2702 -5.4110 -0.0010 -0.0008 -0.0007 5.8147 19.6439 30.8224 43.5782
frequency: 17.0843 30.4103 43.5580 62.7529 88.6736 92.5494 118.9856 123.9568 173.9884 210.2816 226.2381 231.0400 301.2913 320.3731 366.5595 393.6267 398.7893 415.3044 439.1732 502.8465 516.0839 599.1806 631.5415 674.4451 729.4430 750.7891 761.9443 773.7351 820.1012 821.1217 840.7620 850.4152 881.5284 926.6428 962.3107 972.6437 984.6412 1002.0687 1018.9612 1061.5044 1070.1008 1078.2891 1102.9119 1126.3933 1144.9012 1148.8410 1173.0710 1201.8615 1241.4907 1250.4240 1254.7287 1259.3781 1279.3620 1289.2148 1309.0399 1314.8158 1352.4539 1372.3717 1390.2341 1399.5988 1429.8913 1466.6346 1466.8452 1474.3956 1477.1471 1483.1014 1489.9063 1501.7921 1585.4702 1613.8047 1625.7657 2956.8535 2969.4246 2973.2606 2988.0462 2997.1368 2998.2238 3023.5389 3042.7749 3068.6852 3073.2637 3073.3495 3120.6526 3162.9382 3164.4693 3184.9188 3577.1620
redmass: 3.0518 1.9599 4.5067 4.0472 5.3709 2.0393 2.7539 3.7750 3.5908 5.1034 1.4260 2.4448 5.8493 4.7771 5.7277 1.1485 3.7977 2.8530 3.3554 2.9222 5.0315 7.1093 7.0878 4.1640 1.0687 4.3547 1.1255 7.3658 1.3278 7.1845 1.1831 1.5920 2.4815 3.7431 1.1559 1.3516 1.3486 3.1365 3.5966 4.2630 2.4288 2.5964 1.4469 2.6260 1.3312 1.4761 1.1186 1.4355 1.9914 1.5495 1.2434 3.1124 1.0945 1.0930 1.3469 1.3861 1.5712 1.5925 1.2213 5.0861 3.6661 1.0679 1.0801 1.0679 1.0443 1.0738 1.0940 2.7879 7.4767 9.3449 6.7828 1.0586 1.0592 1.0364 1.0597 1.0988 1.0564 1.1026 1.1043 1.1027 1.1024 1.1027 1.0900 1.0948 1.0886 1.0973 1.0660
irintensity: 0.1241 0.1777 0.3823 2.8757 0.2322 0.3653 0.3032 0.6566 3.2044 2.1318 1.8762 5.2600 3.2325 7.9408 6.8125 144.2115 3.4047 3.1509 13.4621 16.6676 1.6071 19.3306 1.5472 28.2208 11.1113 15.6775 0.5055 19.1737 14.7591 6.6382 0.0309 48.0421 9.2132 10.9945 1.2506 1.4118 0.0161 35.5258 1.2920 390.3670 0.7549 69.9938 24.1742 0.7221 280.5988 0.8105 68.1459 0.5633 112.8227 3.9499 1.7563 301.1246 0.3013 0.7075 5.3905 12.9112 0.0930 4.0187 11.0383 41.1328 17.2436 0.3304 0.0792 3.8671 12.2908 0.7124 25.4953 36.5500 10.6695 298.4394 91.0015 6.7700 50.8713 37.3657 15.4003 0.8889 48.6445 15.6891 9.0271 12.9289 92.8132 98.9347 16.1663 4.3812 2.5743 3.9828 57.9780
temp: 298.150 k
press: 1.00000 atm
elementType: 8 8 8 6 6 6 6 6 6 6 6 6 6 6 6 1 1 1 1 1 1 1 1 1 1 1 1 1 1 1 1
symmnumber: 1
zpe: 669228.6 jmol-1
zpe.correction: 0.254896 hartree
zpe.thermalcorrener: 0.270800 hartree
zpe.thermalcorrenthalpy: 0.271744 hartree
zpe.thermalcorrgfe: 0.208866 hartree
zpe.sumelectzpe: -691.417987 hartree
zpe.sumelectthermal: -691.402083 hartree
zpe.sumelectthermalent: -691.401139 hartree
zpe.sumelectthermalfe: -691.464017 hartree
dipole: -0.5932 -0.8279 -0.0292
dipole: 1.0189
quadrupole: -62.8296 -96.4389 -91.5817
quadrupole: -7.4765 0.5555 -0.1803
quadrupole: 20.7871 -12.8221 -7.9650 -7.4765 0.5555 -0.1803
hfenergy: -691.6728828 hartree
pointgroup: C01 [X(C12H16O3)]
dipole: 0.2348658 0.3241569 -0.0213464 debye
polarizability: 220.3335281|9.8066518|139.437832|-0.8341795|-1.1142888|79.0133135 unknown
InChI: InChI=1S/C12H16O3/c1-2-3-4-9-15-12(14)10-5-7-11(13)8-6-10/h5-8,13H,2-4,9H2,1H3
charge 0 multiplicity 1
31 atoms
O  -0.740083 -0.162885 0.097454
O  0.11942 -2.331057 0.130769
O  5.456044 1.387914 0.018262
C  -4.565586 -0.062007 0.055989
C  -3.097543 0.424385 0.025222
C  -5.581478 1.096928 -0.06478
C  -2.114018 -0.741895 0.121918
C  -7.047362 0.614144 -0.031572
C  1.64113 -0.423957 0.082494
C  0.311428 -1.087291 0.106274
C  2.799026 -1.243919 0.07608
C  1.78844 0.990088 0.067139
C  4.082567 -0.669582 0.05432
C  3.066151 1.574205 0.046221
C  4.212702 0.742939 0.039639
H  -4.755552 -0.616386 0.998589
H  -4.737141 -0.783512 -0.770038
H  -2.916365 1.124889 0.863364
H  -2.906713 0.984515 -0.91057
H  -5.409214 1.819793 0.758519
H  -5.392642 1.648866 -1.007893
H  -2.214492 -1.446907 -0.724369
H  -2.236117 -1.314984 1.060246
H  -7.253825 -0.085137 -0.863757
H  -7.269417 0.084328 0.91398
H  -7.753387 1.460249 -0.118298
H  2.669301 -2.33092 0.088214
H  0.893614 1.61812 0.072277
H  4.973903 -1.310089 0.048825
H  3.200651 2.659438 0.034927
H  6.198258 0.733226 0.015755
