program: Gaussian 09
title: 000269582
version: EM64L-G09RevD.01
frameworkgroup: C1[X(C16H13NO4S)]
method: RPBEPBE
basis: SDD
operation: Freq
keyword: #p
keyword: freq=noraman
keyword: PBEPBE/SDD
title: #p freq=noraman PBEPBE/SDD
converged: YES YES NO NO
title: Mulliken charges:
elementType: S O O O O N C C C C C C C C C C C C C C C C H H H H H H H H H H H H H
charge: 0.835192 -0.412419 -0.509518 -0.571200 -0.419855 -0.687230 -0.236591 0.270099 0.091130 0.347160 -0.059008 -0.430038 0.088738 -0.377869 -0.371919 -0.202872 -0.229764 -0.236117 -0.252926 -0.392407 -0.392426 0.515207 0.288767 0.290831 0.201671 0.270834 0.278198 0.236216 0.231586 0.231680 0.231834 0.384346 0.357027 0.315917 0.315725
chargesum: 0.00000
title: Mulliken charges with hydrogens summed into heavy atoms:
elementType: S O O O O N C C C C C C C C C C C C C C C C
charge: 0.835192 -0.028074 -0.509518 -0.571200 -0.062828 -0.055588 -0.236591 0.270099 0.091130 0.347160 -0.059008 -0.141271 0.088738 -0.087037 -0.170248 0.067962 0.048434 0.000099 -0.021339 -0.160727 -0.160592 0.515207
polarizability: 3.19925149e+02 -1.38380580e+01 2.00544610e+02 -1.73342581e+01 2.40590943e+01 1.83643175e+02
1716.lowfreq: -6.6308 -5.6060 -0.0023 -0.0013 0.0007 5.7983 15.6417 27.5566 33.2777
frequency: 15.2162 27.5297 33.2179 73.9586 114.6933 126.9967 130.2176 158.9507 173.7023 203.7300 212.0289 223.7927 242.0381 267.7807 291.4324 304.7329 329.3628 355.2191 386.3571 405.2326 411.4027 412.5244 415.9772 426.0421 433.1861 442.2899 470.4844 491.7683 512.8483 520.8033 568.3583 601.8727 612.1952 613.4659 622.9874 660.5880 703.6301 715.8801 727.1086 760.8473 770.5017 796.3298 808.1207 813.2026 815.9233 835.8026 859.2716 881.8639 885.7366 909.8325 949.3484 963.9026 964.0114 981.0144 1001.8968 1022.0153 1022.4520 1047.1577 1051.5024 1056.2799 1132.7548 1141.7092 1147.8328 1179.8636 1184.6963 1203.9932 1266.9555 1276.8828 1299.8748 1323.1849 1327.1782 1385.8046 1399.3603 1416.8791 1430.7538 1433.3651 1440.3902 1489.9837 1495.4045 1524.8710 1577.6180 1586.5074 1608.7931 1614.0822 1630.3645 1649.3819 2716.3875 3102.1295 3135.1967 3137.1489 3139.8250 3159.0450 3161.1375 3165.3312 3166.0164 3178.1834 3562.3147 3585.8736 3701.1515
redmass: 6.4078 6.3860 3.7270 5.9861 4.6867 6.7463 3.8801 7.2351 5.7448 1.6085 7.4432 6.7882 5.8361 6.1698 5.9915 5.1824 5.9430 6.8355 5.4876 3.8872 1.7526 1.3654 4.3760 3.3095 1.4878 5.4693 7.9203 6.3546 4.7105 2.9629 5.5216 5.5441 4.2164 4.6340 6.8404 4.6504 6.1273 3.3661 9.6784 8.2020 1.4453 2.5136 4.8111 5.2030 1.2837 1.8100 1.4895 1.8104 1.9781 2.2153 1.3618 1.3585 1.3636 4.8121 1.3401 3.4393 1.5130 2.7472 2.5604 3.8868 1.1940 1.3215 1.5867 1.1106 1.1187 1.9615 1.7720 3.3493 1.2980 2.6257 2.3378 2.9608 5.3506 6.7278 2.8750 3.7548 2.6010 2.8543 1.8355 4.0159 4.6300 7.3515 6.9330 4.8452 6.1061 1.2218 1.0709 1.0880 1.0890 1.0888 1.0888 1.0948 1.0955 1.0942 1.0939 1.0976 1.0453 1.0658 1.1040
irintensity: 1.0321 1.9143 0.0945 0.8823 0.9213 1.4418 10.7116 0.7856 4.1867 80.0944 2.7487 18.2499 4.8929 6.4169 11.3817 13.7198 10.3963 16.9214 1.8327 4.4773 2.2933 2.0959 13.7148 18.2778 208.7384 128.9513 103.6833 12.6949 32.2218 64.8611 9.0816 1.0215 42.1752 29.1785 2.5360 24.9162 22.9012 17.0743 89.5922 32.6337 78.4076 15.4632 16.7380 9.5063 4.1063 75.6601 6.9689 24.1048 77.8482 133.1430 3.0781 1.5918 1.0690 3.9664 0.7655 12.0248 3.5285 24.6317 62.9220 25.3335 23.4920 184.6363 9.9055 5.7506 53.1401 6.8241 8.3397 65.5358 4.2939 82.9280 47.3579 152.9665 7.1816 9.5620 66.3065 7.9950 40.2563 91.5065 23.6798 3.7768 62.8604 10.8175 21.1271 175.1150 12.9803 274.0804 773.2982 12.9493 11.5211 14.6404 13.1589 20.1570 5.0117 9.9770 6.1616 14.6425 121.5448 26.0274 25.7898
temp: 298.150 k
press: 1.00000 atm
elementType: 16 8 8 8 8 7 6 6 6 6 6 6 6 6 6 6 6 6 6 6 6 6 1 1 1 1 1 1 1 1 1 1 1 1 1
symmnumber: 1
zpe: 668203.1 jmol-1
zpe.correction: 0.254505 hartree
zpe.thermalcorrener: 0.274138 hartree
zpe.thermalcorrenthalpy: 0.275082 hartree
zpe.thermalcorrgfe: 0.205459 hartree
zpe.sumelectzpe: -1369.517132 hartree
zpe.sumelectthermal: -1369.497500 hartree
zpe.sumelectthermalent: -1369.496555 hartree
zpe.sumelectthermalfe: -1369.566178 hartree
dipole: -1.9067 5.0805 -6.0972
dipole: 8.1623
quadrupole: -84.8714 -137.2321 -138.0440
quadrupole: -7.9058 15.7537 6.0433
quadrupole: 35.1778 -17.1830 -17.9948 -7.9058 15.7537 6.0433
hfenergy: -1369.7716375 hartree
pointgroup: C01 [X(C16H13N1O4S1)]
dipole: -0.7256337 1.8250782 2.5406689 debye
polarizability: 316.8110916|24.6668988|197.7112658|-13.8147913|-26.7812088|189.5905772 unknown
InChI: InChI=1S/C16H13NO4S/c17-10-5-7-11(8-6-10)22(20,21)15-9-14(18)12-3-1-2-4-13(12)16(15)19/h1-9,18-19H,17H2
charge 0 multiplicity 1
35 atoms
S  -1.141233 -1.114961 -1.358605
O  0.97167 1.031612 -2.390445
O  -1.362564 -2.726479 -1.233255
O  -1.157668 -0.338376 -2.841749
O  2.498592 -1.804956 2.267473
N  -5.501713 1.486318 1.945336
C  0.52581 -0.648861 -0.630022
C  2.55763 0.69218 -0.59686
C  1.303887 0.355002 -1.235472
C  2.972691 0.004487 0.605513
C  -2.467423 -0.296056 -0.3294
C  0.937303 -1.380512 0.515037
C  2.145694 -1.061604 1.125252
C  3.38975 1.71322 -1.150956
C  4.20229 0.400648 1.225179
C  -2.807073 1.043348 -0.593008
C  -3.122685 -1.072044 0.643995
C  4.593548 2.06378 -0.532925
C  4.99831 1.406619 0.668324
C  -3.823057 1.639119 0.17259
C  -4.138693 -0.472152 1.406699
C  -4.499654 0.893701 1.188364
H  0.334023 -2.207756 0.900299
H  3.052998 2.206451 -2.066905
H  4.530952 -0.06719 2.16261
H  -2.306373 1.599434 -1.391887
H  -2.854547 -2.125109 0.778962
H  5.225611 2.846986 -0.964106
H  5.933662 1.697182 1.158541
H  -4.104347 2.681388 -0.016216
H  -4.662344 -1.058082 2.170536
H  0.124062 0.591416 -2.79807
H  3.460851 -1.709714 2.472914
H  -5.993585 0.962082 2.663456
H  -5.770476 2.453982 1.791002
